{"text_format":"1","workbook":"xlsx","n_sheets":3,"sheets":["Tabelle1","Teams","Eckdaten"],"not_rendered":{"charts":0,"images":9,"macros":1,"external_links":0,"defined_names":0,"comments":0,"pivot_tables":0},"unopened":[],"bounds":{"document_bytes":16777216,"sheet_cells":100000,"rows_first":2000,"rows_last":500,"rows_between":2000,"halvings":0,"cell_chars":16384,"cell_head_chars":4096},"cells_cut":0,"cells_raw":0,"read":"whole","date_system":"1900"}

{"sheet":"Tabelle1","index":0,"n_rows":128,"n_cols":33,"rows_kept":128,"cut":false,"hidden":false,"merged":[[120,0,123,0],[122,2,122,3],[123,2,123,3],[124,0,127,0],[126,2,126,3],[127,2,127,3],[112,0,115,0],[116,0,119,0],[118,2,118,3],[119,2,119,3],[114,2,114,3],[115,2,115,3],[56,0,57,0],[56,1,57,1],[2,0,3,0],[2,1,3,1],[0,2,0,4],[0,25,0,27],[0,28,0,30],[0,5,0,7],[0,8,0,10],[0,11,0,13],[0,14,0,16],[0,17,0,19]]}
[]
[null,null,null,null,"Hindernisslauf",null,null,"Farmerwalk",null,null,"Reifenweitwurf",null,null,"Gummisiefelweitwurf",null,null,"Palette",null,null,{"$f":"R3","v":"Reifenrollen"},null,null,null,null,null,null,null,{"$f":"Z3","v":"Zusatz 1"},null,null,{"$f":"AC3","v":"Zusatz 2"}]
["Startnummer","Name","Hindernisslauf Zeit","Punkte HNL","Rang HNL","Farmerwalk","Punke FW","Rang FW","Reifenweitwurf","Punkte RW","Rang RW","Gummisiefelweitwurf","Punkte GW","Rang GW","Palette","Punkte PH","Rang PH","Reifenrollen","Punkte RR","Rang RR","Rechnungssummer","heißer Draht","Zeitstrafe","Punkte hD","Rang hD","Zusatz 1","Punke Z1","Rang Z1","Zusatz 2","Punkte Z2","Rang Z2","Gesamtpunkte","Rang"]
[null,null,"Zeit in sec.",null,null,"Zeit in sec",null,{"$f":"H2","v":"Farmerwalk"},"in m",null,{"$f":"K2","v":"Reifenweitwurf"},"in m",null,{"$f":"N2","v":"Gummisiefelweitwurf"},"Zeit in sec",null,{"$f":"Q2","v":"Palette"},"Zeit in sec",null,{"$f":"T2","v":"Reifenrollen"},"gesamt","Zeit in sec.","in berührungen",null,null,"positiv",null,{"$f":"AB2","v":"Zusatz 1"},"negativ",null,{"$f":"AE2","v":"Zusatz 2"}]
["1M","Stefan Lehner",27,{"$f":"IF(Tabelle1!$C5=\"\",\"\",Eckdaten!$A$2-Tabelle1!$E5+1)","v":42},{"$f":"IF(C5=0,\"\",RANK(C5,$C$5:$C$54,1))","v":9},17.850000000000001,{"$f":"IF(Tabelle1!$F5=\"\",\"\",Eckdaten!$A$2-Tabelle1!$H5+1)","v":49},{"$f":"IF(F5=0,\"\",RANK(F5,$F$5:$F$54,1))","v":2},null,{"$f":"IF(Tabelle1!$I5=\"\",\"\",Eckdaten!$A$2-K5+1)","v":""},{"$f":"IF(I5=0,\"\",RANK(I5,$I$5:$I$54,))","v":""},24.1,{"$f":"IF(L5=\"\",\"\",Eckdaten!$A$2-N5+1)","v":44},{"$f":"IF(L5=0,\"\",RANK(L5,$L$5:$L$54))","v":7},34.07,{"$f":"IF(Tabelle1!$O5=\"\",\"\",Eckdaten!$A$2-Q5+1)","v":43},{"$f":"IF(O5=0,\"\",RANK(O5,$O$5:$O$54))","v":8},11.33,{"$f":"IF(R5=\"\",\"\",Eckdaten!$A$2-T5+1)","v":47},{"$f":"IF(R5=0,\"\",RANK(R5,$R$5:$R$54,1))","v":4},{"$f":"IF(V5=\"\",\"\",V5+(W5*Eckdaten!$A$9))","v":30.79},30.79,null,{"$f":"IF(V5=\"\",\"\",Eckdaten!$A$2-Y5+1)","v":50},{"$f":"IF(ISERROR(IF(U5=0,\"\",RANK(U5,$U$5:$U$54,1))),\"\",IF(U5=0,\"\",RANK(U5,$U$5:$U$54,1)))","v":1},16.78,{"$f":"IF(Tabelle1!$Z5=\"\",\"\",Eckdaten!$A$2-Tabelle1!$AB5+1)","v":50},{"$f":"IF(Z5=0,\"\",RANK(Z5,$Z$5:$Z$54,1))","v":1},null,{"$f":"IF(Tabelle1!$AC5=\"\",\"\",Eckdaten!$A$2-AE5+1)","v":""},{"$f":"IF(AC5=0,\"\",RANK(AC5,$AC$5:$AC$54))","v":""},{"$f":"SUM(Tabelle1!$S5,Tabelle1!$P5,Tabelle1!$M5,Tabelle1!$J5,Tabelle1!$G5,Tabelle1!$D5,AA5,AD5,X5)","v":325},{"$f":"IF(AF5=0,\"\",RANK(AF5,$AF$5:$AF$54))","v":1}]
["2M","David Gruber",28.44,{"$f":"IF(Tabelle1!$C6=\"\",\"\",Eckdaten!$A$2-Tabelle1!$E6+1)","v":39},{"$f":"IF(C6=0,\"\",RANK(C6,$C$5:$C$54,1))","v":12},19.37,{"$f":"IF(Tabelle1!$F6=\"\",\"\",Eckdaten!$A$2-Tabelle1!$H6+1)","v":45},{"$f":"IF(F6=0,\"\",RANK(F6,$F$5:$F$54,1))","v":6},null,{"$f":"IF(Tabelle1!$I6=\"\",\"\",Eckdaten!$A$2-K6+1)","v":""},{"$f":"IF(I6=0,\"\",RANK(I6,$I$5:$I$54,))","v":""},22.6,{"$f":"IF(L6=\"\",\"\",Eckdaten!$A$2-N6+1)","v":38},{"$f":"IF(L6=0,\"\",RANK(L6,$L$5:$L$54))","v":13},45.67,{"$f":"IF(Tabelle1!$O6=\"\",\"\",Eckdaten!$A$2-Q6+1)","v":49},{"$f":"IF(O6=0,\"\",RANK(O6,$O$5:$O$54))","v":2},12.11,{"$f":"IF(R6=\"\",\"\",Eckdaten!$A$2-T6+1)","v":46},{"$f":"IF(R6=0,\"\",RANK(R6,$R$5:$R$54,1))","v":5},{"$f":"IF(V6=\"\",\"\",V6+(W6*Eckdaten!$A$9))","v":54.45},54.45,null,{"$f":"IF(V6=\"\",\"\",Eckdaten!$A$2-Y6+1)","v":37},14,23.42,{"$f":"IF(Tabelle1!$Z6=\"\",\"\",Eckdaten!$A$2-Tabelle1!$AB6+1)","v":47},{"$f":"IF(Z6=0,\"\",RANK(Z6,$Z$5:$Z$54,1))","v":4},null,{"$f":"IF(Tabelle1!$AC6=\"\",\"\",Eckdaten!$A$2-AE6+1)","v":""},{"$f":"IF(AC6=0,\"\",RANK(AC6,$AC$5:$AC$54))","v":""},{"$f":"SUM(Tabelle1!$S6,Tabelle1!$P6,Tabelle1!$M6,Tabelle1!$J6,Tabelle1!$G6,Tabelle1!$D6,AA6,AD6,X6)","v":301},{"$f":"IF(AF6=0,\"\",RANK(AF6,$AF$5:$AF$54))","v":7}]
["3M","Alois Matha",27.14,{"$f":"IF(Tabelle1!$C7=\"\",\"\",Eckdaten!$A$2-Tabelle1!$E7+1)","v":41},10,19.38,{"$f":"IF(Tabelle1!$F7=\"\",\"\",Eckdaten!$A$2-Tabelle1!$H7+1)","v":44},7,null,{"$f":"IF(Tabelle1!$I7=\"\",\"\",Eckdaten!$A$2-K7+1)","v":""},"",25.9,{"$f":"IF(L7=\"\",\"\",Eckdaten!$A$2-N7+1)","v":50},1,24.36,{"$f":"IF(Tabelle1!$O7=\"\",\"\",Eckdaten!$A$2-Q7+1)","v":34},17,12.53,{"$f":"IF(R7=\"\",\"\",Eckdaten!$A$2-T7+1)","v":44},7,{"$f":"IF(V7=\"\",\"\",V7+(W7*Eckdaten!$A$9))","v":48.61},48.61,null,{"$f":"IF(V7=\"\",\"\",Eckdaten!$A$2-Y7+1)","v":41},10,23.09,{"$f":"IF(Tabelle1!$Z7=\"\",\"\",Eckdaten!$A$2-Tabelle1!$AB7+1)","v":48},3,null,{"$f":"IF(Tabelle1!$AC7=\"\",\"\",Eckdaten!$A$2-AE7+1)","v":""},"",{"$f":"SUM(Tabelle1!$S7,Tabelle1!$P7,Tabelle1!$M7,Tabelle1!$J7,Tabelle1!$G7,Tabelle1!$D7,AA7,AD7,X7)","v":302},6]
["4M","Martin Reisinger",36.85,{"$f":"IF(Tabelle1!$C8=\"\",\"\",Eckdaten!$A$2-Tabelle1!$E8+1)","v":34},17,21.26,{"$f":"IF(Tabelle1!$F8=\"\",\"\",Eckdaten!$A$2-Tabelle1!$H8+1)","v":39},12,null,{"$f":"IF(Tabelle1!$I8=\"\",\"\",Eckdaten!$A$2-K8+1)","v":""},"",18.2,{"$f":"IF(L8=\"\",\"\",Eckdaten!$A$2-N8+1)","v":34},17,37.590000000000003,{"$f":"IF(Tabelle1!$O8=\"\",\"\",Eckdaten!$A$2-Q8+1)","v":46},5,14.12,{"$f":"IF(R8=\"\",\"\",Eckdaten!$A$2-T8+1)","v":37},14,{"$f":"IF(V8=\"\",\"\",V8+(W8*Eckdaten!$A$9))","v":64.42},64.42,null,{"$f":"IF(V8=\"\",\"\",Eckdaten!$A$2-Y8+1)","v":33},18,47.58,{"$f":"IF(Tabelle1!$Z8=\"\",\"\",Eckdaten!$A$2-Tabelle1!$AB8+1)","v":32},19,null,{"$f":"IF(Tabelle1!$AC8=\"\",\"\",Eckdaten!$A$2-AE8+1)","v":""},"",{"$f":"SUM(Tabelle1!$S8,Tabelle1!$P8,Tabelle1!$M8,Tabelle1!$J8,Tabelle1!$G8,Tabelle1!$D8,AA8,AD8,X8)","v":255},18]
["5M",null,null,{"$f":"IF(Tabelle1!$C9=\"\",\"\",Eckdaten!$A$2-Tabelle1!$E9+1)","v":""},"",null,{"$f":"IF(Tabelle1!$F9=\"\",\"\",Eckdaten!$A$2-Tabelle1!$H9+1)","v":""},"",null,{"$f":"IF(Tabelle1!$I9=\"\",\"\",Eckdaten!$A$2-K9+1)","v":""},"",null,{"$f":"IF(L9=\"\",\"\",Eckdaten!$A$2-N9+1)","v":""},"",null,{"$f":"IF(Tabelle1!$O9=\"\",\"\",Eckdaten!$A$2-Q9+1)","v":""},"",null,{"$f":"IF(R9=\"\",\"\",Eckdaten!$A$2-T9+1)","v":""},"",{"$f":"IF(V9=\"\",\"\",V9+(W9*Eckdaten!$A$9))","v":""},null,null,{"$f":"IF(V9=\"\",\"\",Eckdaten!$A$2-Y9+1)","v":""},"",null,{"$f":"IF(Tabelle1!$Z9=\"\",\"\",Eckdaten!$A$2-Tabelle1!$AB9+1)","v":""},"",null,{"$f":"IF(Tabelle1!$AC9=\"\",\"\",Eckdaten!$A$2-AE9+1)","v":""},"",{"$f":"SUM(Tabelle1!$S9,Tabelle1!$P9,Tabelle1!$M9,Tabelle1!$J9,Tabelle1!$G9,Tabelle1!$D9,AA9,AD9,X9)","v":0},""]
["6M","Thomas Altmann",34.65,{"$f":"IF(Tabelle1!$C10=\"\",\"\",Eckdaten!$A$2-Tabelle1!$E10+1)","v":36},15,18.21,{"$f":"IF(Tabelle1!$F10=\"\",\"\",Eckdaten!$A$2-Tabelle1!$H10+1)","v":48},3,null,{"$f":"IF(Tabelle1!$I10=\"\",\"\",Eckdaten!$A$2-K10+1)","v":""},"",0.1,{"$f":"IF(L10=\"\",\"\",Eckdaten!$A$2-N10+1)","v":32},19,26.95,{"$f":"IF(Tabelle1!$O10=\"\",\"\",Eckdaten!$A$2-Q10+1)","v":37},14,15.82,{"$f":"IF(R10=\"\",\"\",Eckdaten!$A$2-T10+1)","v":34},17,{"$f":"IF(V10=\"\",\"\",V10+(W10*Eckdaten!$A$9))","v":47.16},47.16,null,{"$f":"IF(V10=\"\",\"\",Eckdaten!$A$2-Y10+1)","v":43},8,34.72,{"$f":"IF(Tabelle1!$Z10=\"\",\"\",Eckdaten!$A$2-Tabelle1!$AB10+1)","v":35},16,null,{"$f":"IF(Tabelle1!$AC10=\"\",\"\",Eckdaten!$A$2-AE10+1)","v":""},"",{"$f":"SUM(Tabelle1!$S10,Tabelle1!$P10,Tabelle1!$M10,Tabelle1!$J10,Tabelle1!$G10,Tabelle1!$D10,AA10,AD10,X10)","v":265},14]
["7M","Stefan Obergruber",26.67,{"$f":"IF(Tabelle1!$C11=\"\",\"\",Eckdaten!$A$2-Tabelle1!$E11+1)","v":43},8,26.05,{"$f":"IF(Tabelle1!$F11=\"\",\"\",Eckdaten!$A$2-Tabelle1!$H11+1)","v":32},19,null,{"$f":"IF(Tabelle1!$I11=\"\",\"\",Eckdaten!$A$2-K11+1)","v":""},"",21.1,{"$f":"IF(L11=\"\",\"\",Eckdaten!$A$2-N11+1)","v":36},15,28.17,{"$f":"IF(Tabelle1!$O11=\"\",\"\",Eckdaten!$A$2-Q11+1)","v":40},11,14.57,{"$f":"IF(R11=\"\",\"\",Eckdaten!$A$2-T11+1)","v":35},{"$f":"IF(R11=0,\"\",RANK(R11,$R$5:$R$54,1))","v":16},{"$f":"IF(V11=\"\",\"\",V11+(W11*Eckdaten!$A$9))","v":38.200000000000003},38.200000000000003,null,{"$f":"IF(V11=\"\",\"\",Eckdaten!$A$2-Y11+1)","v":47},4,25.86,{"$f":"IF(Tabelle1!$Z11=\"\",\"\",Eckdaten!$A$2-Tabelle1!$AB11+1)","v":45},6,null,{"$f":"IF(Tabelle1!$AC11=\"\",\"\",Eckdaten!$A$2-AE11+1)","v":""},"",{"$f":"SUM(Tabelle1!$S11,Tabelle1!$P11,Tabelle1!$M11,Tabelle1!$J11,Tabelle1!$G11,Tabelle1!$D11,AA11,AD11,X11)","v":278},13]
["8M","Kastl Max",32.840000000000003,{"$f":"IF(Tabelle1!$C12=\"\",\"\",Eckdaten!$A$2-Tabelle1!$E12+1)","v":37},14,21.24,{"$f":"IF(Tabelle1!$F12=\"\",\"\",Eckdaten!$A$2-Tabelle1!$H12+1)","v":40},11,null,{"$f":"IF(Tabelle1!$I12=\"\",\"\",Eckdaten!$A$2-K12+1)","v":""},"",24.6,{"$f":"IF(L12=\"\",\"\",Eckdaten!$A$2-N12+1)","v":47},4,38.299999999999997,{"$f":"IF(Tabelle1!$O12=\"\",\"\",Eckdaten!$A$2-Q12+1)","v":47},4,13.25,{"$f":"IF(R12=\"\",\"\",Eckdaten!$A$2-T12+1)","v":41},10,{"$f":"IF(V12=\"\",\"\",V12+(W12*Eckdaten!$A$9))","v":38.159999999999997},38.159999999999997,null,{"$f":"IF(V12=\"\",\"\",Eckdaten!$A$2-Y12+1)","v":48},3,25.93,{"$f":"IF(Tabelle1!$Z12=\"\",\"\",Eckdaten!$A$2-Tabelle1!$AB12+1)","v":44},7,null,{"$f":"IF(Tabelle1!$AC12=\"\",\"\",Eckdaten!$A$2-AE12+1)","v":""},"",{"$f":"SUM(Tabelle1!$S12,Tabelle1!$P12,Tabelle1!$M12,Tabelle1!$J12,Tabelle1!$G12,Tabelle1!$D12,AA12,AD12,X12)","v":304},5]
["9M","Marco Hofstätter",25.14,{"$f":"IF(Tabelle1!$C13=\"\",\"\",Eckdaten!$A$2-Tabelle1!$E13+1)","v":48},3,17.27,{"$f":"IF(Tabelle1!$F13=\"\",\"\",Eckdaten!$A$2-Tabelle1!$H13+1)","v":50},1,null,{"$f":"IF(Tabelle1!$I13=\"\",\"\",Eckdaten!$A$2-K13+1)","v":""},"",24.3,{"$f":"IF(L13=\"\",\"\",Eckdaten!$A$2-N13+1)","v":45},6,46.35,{"$f":"IF(Tabelle1!$O13=\"\",\"\",Eckdaten!$A$2-Q13+1)","v":50},1,10.57,{"$f":"IF(R13=\"\",\"\",Eckdaten!$A$2-T13+1)","v":49},2,{"$f":"IF(V13=\"\",\"\",V13+(W13*Eckdaten!$A$9))","v":48.58},48.58,null,{"$f":"IF(V13=\"\",\"\",Eckdaten!$A$2-Y13+1)","v":42},9,35.130000000000003,{"$f":"IF(Tabelle1!$Z13=\"\",\"\",Eckdaten!$A$2-Tabelle1!$AB13+1)","v":34},17,null,{"$f":"IF(Tabelle1!$AC13=\"\",\"\",Eckdaten!$A$2-AE13+1)","v":""},"",{"$f":"SUM(Tabelle1!$S13,Tabelle1!$P13,Tabelle1!$M13,Tabelle1!$J13,Tabelle1!$G13,Tabelle1!$D13,AA13,AD13,X13)","v":318},3]
["10M",null,null,{"$f":"IF(Tabelle1!$C14=\"\",\"\",Eckdaten!$A$2-Tabelle1!$E14+1)","v":""},"",null,{"$f":"IF(Tabelle1!$F14=\"\",\"\",Eckdaten!$A$2-Tabelle1!$H14+1)","v":""},"",null,{"$f":"IF(Tabelle1!$I14=\"\",\"\",Eckdaten!$A$2-K14+1)","v":""},"",null,{"$f":"IF(L14=\"\",\"\",Eckdaten!$A$2-N14+1)","v":""},"",null,{"$f":"IF(Tabelle1!$O14=\"\",\"\",Eckdaten!$A$2-Q14+1)","v":""},"",null,{"$f":"IF(R14=\"\",\"\",Eckdaten!$A$2-T14+1)","v":""},"",{"$f":"IF(V14=\"\",\"\",V14+(W14*Eckdaten!$A$9))","v":""},null,null,{"$f":"IF(V14=\"\",\"\",Eckdaten!$A$2-Y14+1)","v":""},"",null,{"$f":"IF(Tabelle1!$Z14=\"\",\"\",Eckdaten!$A$2-Tabelle1!$AB14+1)","v":""},"",null,{"$f":"IF(Tabelle1!$AC14=\"\",\"\",Eckdaten!$A$2-AE14+1)","v":""},"",{"$f":"SUM(Tabelle1!$S14,Tabelle1!$P14,Tabelle1!$M14,Tabelle1!$J14,Tabelle1!$G14,Tabelle1!$D14,AA14,AD14,X14)","v":0},""]
["11M","Christian Pühringer",47.11,{"$f":"IF(Tabelle1!$C15=\"\",\"\",Eckdaten!$A$2-Tabelle1!$E15+1)","v":32},19,25.98,{"$f":"IF(Tabelle1!$F15=\"\",\"\",Eckdaten!$A$2-Tabelle1!$H15+1)","v":33},18,null,{"$f":"IF(Tabelle1!$I15=\"\",\"\",Eckdaten!$A$2-K15+1)","v":""},"",24.8,{"$f":"IF(L15=\"\",\"\",Eckdaten!$A$2-N15+1)","v":48},3,34.82,{"$f":"IF(Tabelle1!$O15=\"\",\"\",Eckdaten!$A$2-Q15+1)","v":44},7,23.83,{"$f":"IF(R15=\"\",\"\",Eckdaten!$A$2-T15+1)","v":32},19,{"$f":"IF(V15=\"\",\"\",V15+(W15*Eckdaten!$A$9))","v":70.13},70.13,null,{"$f":"IF(V15=\"\",\"\",Eckdaten!$A$2-Y15+1)","v":32},19,26.6,{"$f":"IF(Tabelle1!$Z15=\"\",\"\",Eckdaten!$A$2-Tabelle1!$AB15+1)","v":43},8,null,{"$f":"IF(Tabelle1!$AC15=\"\",\"\",Eckdaten!$A$2-AE15+1)","v":""},"",{"$f":"SUM(Tabelle1!$S15,Tabelle1!$P15,Tabelle1!$M15,Tabelle1!$J15,Tabelle1!$G15,Tabelle1!$D15,AA15,AD15,X15)","v":264},16]
{"$rows_left_out":114}
{"sheet":"Teams","index":1,"n_rows":61,"n_cols":20,"rows_kept":61,"cut":false,"hidden":false,"merged":[[2,16,2,17],[2,18,2,19]]}
["TEAMS"]
[null,null,null,null,null,null,null,null,null,null,null,null,"Reihung Suchkriterien",null,null,null,"Verfügbare Namen"]
["Team 1","Starter","6M","17M","16M",null,{"$f":"A3","v":"Team 1"},{"$f":"C4","v":"Thomas Altmann"},{"$f":"D4","v":"Christian Natschläger"},{"$f":"E4","v":"Markus Kraml"},{"$f":"F5","v":778},null,"1. 4 Plätze",null,null,null,"Männer",null,"Frauen"]
["Rang","Namen",{"$f":"IF(ISNA(VLOOKUP(C3,Tabelle1!$A$5:$AG$153,2,FALSE)),\"\",VLOOKUP(C3,Tabelle1!$A$5:$AG$153,2,FALSE))","v":"Thomas Altmann"},{"$f":"IF(ISNA(VLOOKUP(D3,Tabelle1!$A$5:$AG$153,2,FALSE)),\"\",VLOOKUP(D3,Tabelle1!$A$5:$AG$153,2,FALSE))","v":"Christian Natschläger"},{"$f":"IF(ISNA(VLOOKUP(E3,Tabelle1!$A$5:$AG$153,2,FALSE)),\"\",VLOOKUP(E3,Tabelle1!$A$5:$AG$153,2,FALSE))","v":"Markus Kraml"},"Gesamtpunkte",null,null,null,null,null,null,{"$f":"MAX(F3:F61)","v":929},null,{"$f":"COUNTIF(M4:M7,M4)","v":1},null,{"$f":"Tabelle1!A5","v":"1M"},{"$f":"Tabelle1!B5","v":"Stefan Lehner"},{"$f":"Tabelle1!A59","v":"1F"},{"$f":"Tabelle1!B59","v":"Katharina Strasser"}]
[{"$f":"IF(F5=0,\"\",RANK(F5,$F$2:$F$1603,0))","v":6},"Punkte",{"$f":"IF(ISNA(VLOOKUP(C3,Tabelle1!$A$5:$AG$153,32,FALSE)),0,VLOOKUP(C3,Tabelle1!$A$5:$AG$153,32,FALSE))","v":265},{"$f":"IF(ISNA(VLOOKUP(D3,Tabelle1!$A$5:$AG$153,32,FALSE)),0,VLOOKUP(D3,Tabelle1!$A$5:$AG$153,32,FALSE))","v":265},{"$f":"IF(ISNA(VLOOKUP(E3,Tabelle1!$A$5:$AG$153,32,FALSE)),0,VLOOKUP(E3,Tabelle1!$A$5:$AG$153,32,FALSE))","v":248},{"$f":"SUM(C5+D5+E5)","v":778},{"$f":"G3","v":"Team 1"},{"$f":"H3","v":"Thomas Altmann"},{"$f":"I3","v":"Christian Natschläger"},"Markus Kraml",778,null,{"$f":"LARGE($F$4:$F$104,2)","v":914},null,{"$f":"COUNTIF(M4:M7,M5)","v":1},null,{"$f":"Tabelle1!A6","v":"2M"},{"$f":"Tabelle1!B6","v":"David Gruber"},{"$f":"Tabelle1!A60","v":"2F"},{"$f":"Tabelle1!B60","v":"Magdalena Schürz"}]
[null,null,null,null,null,null,null,null,null,null,null,null,{"$f":"LARGE($F$4:$F$104,3)","v":896},null,{"$f":"COUNTIF(M4:M7,M6)","v":1},null,{"$f":"Tabelle1!A7","v":"3M"},{"$f":"Tabelle1!B7","v":"Alois Matha"},{"$f":"Tabelle1!A61","v":"3F"},{"$f":"Tabelle1!B61","v":"Marina Stöttner"}]
["Team 2","Starter","9M","19M","18M",null,{"$f":"A7","v":"Team 2"},{"$f":"C8","v":"Marco Hofstätter"},{"$f":"D8","v":"Bastian Enzenhofer"},{"$f":"E8","v":"Erich Haider"},{"$f":"F9","v":890},null,{"$f":"LARGE($F$4:$F$104,4)","v":890},null,{"$f":"COUNTIF(M4:M7,M7)","v":1},null,{"$f":"Tabelle1!A8","v":"4M"},{"$f":"Tabelle1!B8","v":"Martin Reisinger"},{"$f":"Tabelle1!A62","v":"4F"},{"$f":"Tabelle1!B62","v":0}]
["Rang","Namen",{"$f":"IF(ISNA(VLOOKUP(C7,Tabelle1!$A$5:$AG$153,2,FALSE)),\"\",VLOOKUP(C7,Tabelle1!$A$5:$AG$153,2,FALSE))","v":"Marco Hofstätter"},{"$f":"IF(ISNA(VLOOKUP(D7,Tabelle1!$A$5:$AG$153,2,FALSE)),\"\",VLOOKUP(D7,Tabelle1!$A$5:$AG$153,2,FALSE))","v":"Bastian Enzenhofer"},{"$f":"IF(ISNA(VLOOKUP(E7,Tabelle1!$A$5:$AG$153,2,FALSE)),\"\",VLOOKUP(E7,Tabelle1!$A$5:$AG$153,2,FALSE))","v":"Erich Haider"},"Gesamtpunkte",null,null,null,null,null,null,null,null,{"$f":"SUM(O4:O7)","v":4},null,{"$f":"Tabelle1!A9","v":"5M"},{"$f":"Tabelle1!B9","v":0},{"$f":"Tabelle1!A63","v":"5F"},{"$f":"Tabelle1!B63","v":0}]
[{"$f":"IF(F9=0,\"\",RANK(F9,$F$2:$F$1603,0))","v":4},"Punkte",{"$f":"IF(ISNA(VLOOKUP(C7,Tabelle1!$A$5:$AG$153,32,FALSE)),0,VLOOKUP(C7,Tabelle1!$A$5:$AG$153,32,FALSE))","v":318},{"$f":"IF(ISNA(VLOOKUP(D7,Tabelle1!$A$5:$AG$153,32,FALSE)),0,VLOOKUP(D7,Tabelle1!$A$5:$AG$153,32,FALSE))","v":284},{"$f":"IF(ISNA(VLOOKUP(E7,Tabelle1!$A$5:$AG$153,32,FALSE)),0,VLOOKUP(E7,Tabelle1!$A$5:$AG$153,32,FALSE))","v":288},{"$f":"SUM(C9+D9+E9)","v":890},{"$f":"G7","v":"Team 2"},{"$f":"H7","v":"Marco Hofstätter"},{"$f":"I7","v":"Bastian Enzenhofer"},"Erich Haider",890,null,null,null,null,null,{"$f":"Tabelle1!A10","v":"6M"},{"$f":"Tabelle1!B10","v":"Thomas Altmann"},{"$f":"Tabelle1!A64","v":"6F"},{"$f":"Tabelle1!B64","v":0}]
[null,null,null,null,null,null,null,null,null,null,null,null,null,null,null,null,{"$f":"Tabelle1!A11","v":"7M"},{"$f":"Tabelle1!B11","v":"Stefan Obergruber"},{"$f":"Tabelle1!A65","v":"7F"},{"$f":"Tabelle1!B65","v":0}]
["Team 3","Starter","14M","13M","4M",null,{"$f":"A11","v":"Team 3"},{"$f":"C12","v":"Günther Pichler"},{"$f":"D12","v":"Thomas Lindorfer"},{"$f":"E12","v":"Martin Reisinger"},{"$f":"F13","v":829},null,null,null,null,null,{"$f":"Tabelle1!A12","v":"8M"},{"$f":"Tabelle1!B12","v":"Kastl Max"},{"$f":"Tabelle1!A66","v":"8F"},{"$f":"Tabelle1!B66","v":0}]
["Rang","Namen",{"$f":"IF(ISNA(VLOOKUP(C11,Tabelle1!$A$5:$AG$153,2,FALSE)),\"\",VLOOKUP(C11,Tabelle1!$A$5:$AG$153,2,FALSE))","v":"Günther Pichler"},{"$f":"IF(ISNA(VLOOKUP(D11,Tabelle1!$A$5:$AG$153,2,FALSE)),\"\",VLOOKUP(D11,Tabelle1!$A$5:$AG$153,2,FALSE))","v":"Thomas Lindorfer"},{"$f":"IF(ISNA(VLOOKUP(E11,Tabelle1!$A$5:$AG$153,2,FALSE)),\"\",VLOOKUP(E11,Tabelle1!$A$5:$AG$153,2,FALSE))","v":"Martin Reisinger"},"Gesamtpunkte",null,null,null,null,null,null,null,null,null,null,{"$f":"Tabelle1!A13","v":"9M"},{"$f":"Tabelle1!B13","v":"Marco Hofstätter"},{"$f":"Tabelle1!A67","v":"9F"},{"$f":"Tabelle1!B67","v":0}]
[{"$f":"IF(F13=0,\"\",RANK(F13,$F$2:$F$1603,0))","v":5},"Punkte",{"$f":"IF(ISNA(VLOOKUP(C11,Tabelle1!$A$5:$AG$153,32,FALSE)),0,VLOOKUP(C11,Tabelle1!$A$5:$AG$153,32,FALSE))","v":256},{"$f":"IF(ISNA(VLOOKUP(D11,Tabelle1!$A$5:$AG$153,32,FALSE)),0,VLOOKUP(D11,Tabelle1!$A$5:$AG$153,32,FALSE))","v":318},{"$f":"IF(ISNA(VLOOKUP(E11,Tabelle1!$A$5:$AG$153,32,FALSE)),0,VLOOKUP(E11,Tabelle1!$A$5:$AG$153,32,FALSE))","v":255},{"$f":"SUM(C13+D13+E13)","v":829},{"$f":"G11","v":"Team 3"},{"$f":"H11","v":"Günther Pichler"},{"$f":"I11","v":"Thomas Lindorfer"},"Martin Reisinger",829,null,null,null,null,null,{"$f":"Tabelle1!A14","v":"10M"},{"$f":"Tabelle1!B14","v":0},{"$f":"Tabelle1!A68","v":"10F"},{"$f":"Tabelle1!B68","v":0}]
[null,null,null,null,null,null,null,null,null,null,null,null,null,null,null,null,{"$f":"Tabelle1!A15","v":"11M"},{"$f":"Tabelle1!B15","v":"Christian Pühringer"},{"$f":"Tabelle1!A69","v":"11F"},{"$f":"Tabelle1!B69","v":0}]
["Team 4","Starter","1M","15M","11m",null,{"$f":"A15","v":"Team 4"},{"$f":"C16","v":"Stefan Lehner"},{"$f":"D16","v":"Dominik Engleder"},{"$f":"E16","v":"Christian Pühringer"},{"$f":"F17","v":914},null,null,null,null,null,{"$f":"Tabelle1!A16","v":"12M"},{"$f":"Tabelle1!B16","v":0},{"$f":"Tabelle1!A70","v":"12F"},{"$f":"Tabelle1!B70","v":0}]
{"$rows_left_out":47}
{"sheet":"Eckdaten","index":2,"n_rows":53,"n_cols":29,"rows_kept":53,"cut":false,"hidden":true,"merged":[]}
["Teilnehmer"]
[50]
[]
["Teilnehmer kommen weiter",null,null,null,null,null,null,null,null,null,null,null,null,null,null,null,null,null,null,null,null,null,null,null,null,null,null,null,{"$f":"B4","v":0}]
["von","bis",null,null,null,null,null,null,null,null,null,null,null,null,null,null,null,null,null,null,null,null,null,null,null,null,null,null,{"$f":"B5","v":"bis"}]
[11,{"$f":"A2","v":50},null,null,null,null,null,null,null,null,null,null,null,null,null,null,null,null,null,null,null,null,null,null,null,null,null,null,50]
[null,null,null,null,null,null,null,null,null,null,null,null,null,null,null,null,null,null,null,null,null,null,null,null,null,null,null,null,0]
["Zeitstrafe heißer Draht",null,null,null,null,null,null,null,null,null,null,null,null,null,null,null,null,null,null,null,null,null,null,null,null,null,null,null,0]
[3,"sec je Berührung",null,null,null,null,null,null,null,null,null,null,null,null,null,null,null,null,null,null,null,null,null,null,null,null,null,null,"sec je Berührung"]
[null,null,null,null,null,null,null,null,null,null,null,null,null,null,null,null,null,null,null,null,null,null,null,null,null,null,null,null,0]
[null,null,null,null,null,null,null,null,null,null,null,null,null,null,null,null,null,null,null,null,null,null,null,null,null,null,null,null,0]
[null,null,null,null,null,null,null,null,null,null,null,null,null,null,null,null,null,null,null,null,null,null,null,null,null,null,null,null,0]
[null,null,null,null,null,null,null,null,null,null,null,null,null,null,null,null,null,null,null,null,null,null,null,null,null,null,null,null,0]
[null,null,null,null,null,null,null,null,null,null,null,null,null,null,null,null,null,null,null,null,null,null,null,null,null,null,null,null,0]
[null,null,null,null,null,null,null,null,null,null,null,null,null,null,null,null,null,null,null,null,null,null,null,null,null,null,null,null,0]
{"$rows_left_out":38}