{"text_format":"1","workbook":"xlsx","n_sheets":3,"sheets":["Tabelle1","Teams","Eckdaten"],"not_rendered":{"charts":0,"images":9,"macros":1,"external_links":0,"defined_names":0,"comments":0,"pivot_tables":0},"unopened":[],"bounds":{"document_bytes":16777216,"sheet_cells":100000,"rows_first":2000,"rows_last":500,"rows_between":2000,"halvings":0,"cell_chars":16384,"cell_head_chars":4096},"cells_cut":0,"cells_raw":0,"read":"whole","date_system":"1900"}

{"sheet":"Tabelle1","index":0,"n_rows":128,"n_cols":33,"rows_kept":128,"cut":false,"hidden":false,"merged":[[120,0,123,0],[122,2,122,3],[123,2,123,3],[124,0,127,0],[126,2,126,3],[127,2,127,3],[112,0,115,0],[116,0,119,0],[118,2,118,3],[119,2,119,3],[114,2,114,3],[115,2,115,3],[56,0,57,0],[56,1,57,1],[2,0,3,0],[2,1,3,1],[0,2,0,4],[0,25,0,27],[0,28,0,30],[0,5,0,7],[0,8,0,10],[0,11,0,13],[0,14,0,16],[0,17,0,19]]}
[]
[null,null,null,null,"Hindernisslauf",null,null,"Farmerwalk",null,null,"Reifenweitwurf",null,null,"Gummisiefelweitwurf",null,null,"Palette",null,null,{"$f":"R3","v":"Reifenrollen"},null,null,null,null,null,null,null,{"$f":"Z3","v":"Zusatz 1"},null,null,{"$f":"AC3","v":"Zusatz 2"}]
["Startnummer","Name","Hindernisslauf Zeit","Punkte HNL","Rang HNL","Farmerwalk","Punke FW","Rang FW","Reifenweitwurf","Punkte RW","Rang RW","Gummisiefelweitwurf","Punkte GW","Rang GW","Palette","Punkte PH","Rang PH","Reifenrollen","Punkte RR","Rang RR","Rechnungssummer","heißer Draht","Zeitstrafe","Punkte hD","Rang hD","Zusatz 1","Punke Z1","Rang Z1","Zusatz 2","Punkte Z2","Rang Z2","Gesamtpunkte","Rang"]
[null,null,"Zeit in sec.",null,null,"Zeit in sec",null,{"$f":"H2","v":"Farmerwalk"},"in m",null,{"$f":"K2","v":"Reifenweitwurf"},"in m",null,{"$f":"N2","v":"Gummisiefelweitwurf"},"Zeit in sec",null,{"$f":"Q2","v":"Palette"},"Zeit in sec",null,{"$f":"T2","v":"Reifenrollen"},"gesamt","Zeit in sec.","in berührungen",null,null,"positiv",null,{"$f":"AB2","v":"Zusatz 1"},"negativ",null,{"$f":"AE2","v":"Zusatz 2"}]
["1M","Stefan Lehner",27,{"$f":"IF(Tabelle1!$C5=\"\",\"\",Eckdaten!$A$2-Tabelle1!$E5+1)","v":42},{"$f":"IF(C5=0,\"\",RANK(C5,$C$5:$C$54,1))","v":9},17.850000000000001,{"$f":"IF(Tabelle1!$F5=\"\",\"\",Eckdaten!$A$2-Tabelle1!$H5+1)","v":49},{"$f":"IF(F5=0,\"\",RANK(F5,$F$5:$F$54,1))","v":2},null,{"$f":"IF(Tabelle1!$I5=\"\",\"\",Eckdaten!$A$2-K5+1)","v":""},{"$f":"IF(I5=0,\"\",RANK(I5,$I$5:$I$54,))","v":""},24.1,{"$f":"IF(L5=\"\",\"\",Eckdaten!$A$2-N5+1)","v":44},{"$f":"IF(L5=0,\"\",RANK(L5,$L$5:$L$54))","v":7},34.07,{"$f":"IF(Tabelle1!$O5=\"\",\"\",Eckdaten!$A$2-Q5+1)","v":43},{"$f":"IF(O5=0,\"\",RANK(O5,$O$5:$O$54))","v":8},11.33,{"$f":"IF(R5=\"\",\"\",Eckdaten!$A$2-T5+1)","v":47},{"$f":"IF(R5=0,\"\",RANK(R5,$R$5:$R$54,1))","v":4},{"$f":"IF(V5=\"\",\"\",V5+(W5*Eckdaten!$A$9))","v":30.79},30.79,null,{"$f":"IF(V5=\"\",\"\",Eckdaten!$A$2-Y5+1)","v":50},{"$f":"IF(ISERROR(IF(U5=0,\"\",RANK(U5,$U$5:$U$54,1))),\"\",IF(U5=0,\"\",RANK(U5,$U$5:$U$54,1)))","v":1},16.78,{"$f":"IF(Tabelle1!$Z5=\"\",\"\",Eckdaten!$A$2-Tabelle1!$AB5+1)","v":50},{"$f":"IF(Z5=0,\"\",RANK(Z5,$Z$5:$Z$54,1))","v":1},null,{"$f":"IF(Tabelle1!$AC5=\"\",\"\",Eckdaten!$A$2-AE5+1)","v":""},{"$f":"IF(AC5=0,\"\",RANK(AC5,$AC$5:$AC$54))","v":""},{"$f":"SUM(Tabelle1!$S5,Tabelle1!$P5,Tabelle1!$M5,Tabelle1!$J5,Tabelle1!$G5,Tabelle1!$D5,AA5,AD5,X5)","v":325},{"$f":"IF(AF5=0,\"\",RANK(AF5,$AF$5:$AF$54))","v":1}]
["2M","David Gruber",28.44,{"$f":"IF(Tabelle1!$C6=\"\",\"\",Eckdaten!$A$2-Tabelle1!$E6+1)","v":39},{"$f":"IF(C6=0,\"\",RANK(C6,$C$5:$C$54,1))","v":12},19.37,{"$f":"IF(Tabelle1!$F6=\"\",\"\",Eckdaten!$A$2-Tabelle1!$H6+1)","v":45},{"$f":"IF(F6=0,\"\",RANK(F6,$F$5:$F$54,1))","v":6},null,{"$f":"IF(Tabelle1!$I6=\"\",\"\",Eckdaten!$A$2-K6+1)","v":""},{"$f":"IF(I6=0,\"\",RANK(I6,$I$5:$I$54,))","v":""},22.6,{"$f":"IF(L6=\"\",\"\",Eckdaten!$A$2-N6+1)","v":38},{"$f":"IF(L6=0,\"\",RANK(L6,$L$5:$L$54))","v":13},45.67,{"$f":"IF(Tabelle1!$O6=\"\",\"\",Eckdaten!$A$2-Q6+1)","v":49},{"$f":"IF(O6=0,\"\",RANK(O6,$O$5:$O$54))","v":2},12.11,{"$f":"IF(R6=\"\",\"\",Eckdaten!$A$2-T6+1)","v":46},{"$f":"IF(R6=0,\"\",RANK(R6,$R$5:$R$54,1))","v":5},{"$f":"IF(V6=\"\",\"\",V6+(W6*Eckdaten!$A$9))","v":54.45},54.45,null,{"$f":"IF(V6=\"\",\"\",Eckdaten!$A$2-Y6+1)","v":37},14,23.42,{"$f":"IF(Tabelle1!$Z6=\"\",\"\",Eckdaten!$A$2-Tabelle1!$AB6+1)","v":47},{"$f":"IF(Z6=0,\"\",RANK(Z6,$Z$5:$Z$54,1))","v":4},null,{"$f":"IF(Tabelle1!$AC6=\"\",\"\",Eckdaten!$A$2-AE6+1)","v":""},{"$f":"IF(AC6=0,\"\",RANK(AC6,$AC$5:$AC$54))","v":""},{"$f":"SUM(Tabelle1!$S6,Tabelle1!$P6,Tabelle1!$M6,Tabelle1!$J6,Tabelle1!$G6,Tabelle1!$D6,AA6,AD6,X6)","v":301},{"$f":"IF(AF6=0,\"\",RANK(AF6,$AF$5:$AF$54))","v":7}]
["3M","Alois Matha",27.14,{"$f":"IF(Tabelle1!$C7=\"\",\"\",Eckdaten!$A$2-Tabelle1!$E7+1)","v":41},10,19.38,{"$f":"IF(Tabelle1!$F7=\"\",\"\",Eckdaten!$A$2-Tabelle1!$H7+1)","v":44},7,null,{"$f":"IF(Tabelle1!$I7=\"\",\"\",Eckdaten!$A$2-K7+1)","v":""},"",25.9,{"$f":"IF(L7=\"\",\"\",Eckdaten!$A$2-N7+1)","v":50},1,24.36,{"$f":"IF(Tabelle1!$O7=\"\",\"\",Eckdaten!$A$2-Q7+1)","v":34},17,12.53,{"$f":"IF(R7=\"\",\"\",Eckdaten!$A$2-T7+1)","v":44},7,{"$f":"IF(V7=\"\",\"\",V7+(W7*Eckdaten!$A$9))","v":48.61},48.61,null,{"$f":"IF(V7=\"\",\"\",Eckdaten!$A$2-Y7+1)","v":41},10,23.09,{"$f":"IF(Tabelle1!$Z7=\"\",\"\",Eckdaten!$A$2-Tabelle1!$AB7+1)","v":48},3,null,{"$f":"IF(Tabelle1!$AC7=\"\",\"\",Eckdaten!$A$2-AE7+1)","v":""},"",{"$f":"SUM(Tabelle1!$S7,Tabelle1!$P7,Tabelle1!$M7,Tabelle1!$J7,Tabelle1!$G7,Tabelle1!$D7,AA7,AD7,X7)","v":302},6]
["4M","Martin Reisinger",36.85,{"$f":"IF(Tabelle1!$C8=\"\",\"\",Eckdaten!$A$2-Tabelle1!$E8+1)","v":34},17,21.26,{"$f":"IF(Tabelle1!$F8=\"\",\"\",Eckdaten!$A$2-Tabelle1!$H8+1)","v":39},12,null,{"$f":"IF(Tabelle1!$I8=\"\",\"\",Eckdaten!$A$2-K8+1)","v":""},"",18.2,{"$f":"IF(L8=\"\",\"\",Eckdaten!$A$2-N8+1)","v":34},17,37.590000000000003,{"$f":"IF(Tabelle1!$O8=\"\",\"\",Eckdaten!$A$2-Q8+1)","v":46},5,14.12,{"$f":"IF(R8=\"\",\"\",Eckdaten!$A$2-T8+1)","v":37},14,{"$f":"IF(V8=\"\",\"\",V8+(W8*Eckdaten!$A$9))","v":64.42},64.42,null,{"$f":"IF(V8=\"\",\"\",Eckdaten!$A$2-Y8+1)","v":33},18,47.58,{"$f":"IF(Tabelle1!$Z8=\"\",\"\",Eckdaten!$A$2-Tabelle1!$AB8+1)","v":32},19,null,{"$f":"IF(Tabelle1!$AC8=\"\",\"\",Eckdaten!$A$2-AE8+1)","v":""},"",{"$f":"SUM(Tabelle1!$S8,Tabelle1!$P8,Tabelle1!$M8,Tabelle1!$J8,Tabelle1!$G8,Tabelle1!$D8,AA8,AD8,X8)","v":255},18]
["5M",null,null,{"$f":"IF(Tabelle1!$C9=\"\",\"\",Eckdaten!$A$2-Tabelle1!$E9+1)","v":""},"",null,{"$f":"IF(Tabelle1!$F9=\"\",\"\",Eckdaten!$A$2-Tabelle1!$H9+1)","v":""},"",null,{"$f":"IF(Tabelle1!$I9=\"\",\"\",Eckdaten!$A$2-K9+1)","v":""},"",null,{"$f":"IF(L9=\"\",\"\",Eckdaten!$A$2-N9+1)","v":""},"",null,{"$f":"IF(Tabelle1!$O9=\"\",\"\",Eckdaten!$A$2-Q9+1)","v":""},"",null,{"$f":"IF(R9=\"\",\"\",Eckdaten!$A$2-T9+1)","v":""},"",{"$f":"IF(V9=\"\",\"\",V9+(W9*Eckdaten!$A$9))","v":""},null,null,{"$f":"IF(V9=\"\",\"\",Eckdaten!$A$2-Y9+1)","v":""},"",null,{"$f":"IF(Tabelle1!$Z9=\"\",\"\",Eckdaten!$A$2-Tabelle1!$AB9+1)","v":""},"",null,{"$f":"IF(Tabelle1!$AC9=\"\",\"\",Eckdaten!$A$2-AE9+1)","v":""},"",{"$f":"SUM(Tabelle1!$S9,Tabelle1!$P9,Tabelle1!$M9,Tabelle1!$J9,Tabelle1!$G9,Tabelle1!$D9,AA9,AD9,X9)","v":0},""]
["6M","Thomas Altmann",34.65,{"$f":"IF(Tabelle1!$C10=\"\",\"\",Eckdaten!$A$2-Tabelle1!$E10+1)","v":36},15,18.21,{"$f":"IF(Tabelle1!$F10=\"\",\"\",Eckdaten!$A$2-Tabelle1!$H10+1)","v":48},3,null,{"$f":"IF(Tabelle1!$I10=\"\",\"\",Eckdaten!$A$2-K10+1)","v":""},"",0.1,{"$f":"IF(L10=\"\",\"\",Eckdaten!$A$2-N10+1)","v":32},19,26.95,{"$f":"IF(Tabelle1!$O10=\"\",\"\",Eckdaten!$A$2-Q10+1)","v":37},14,15.82,{"$f":"IF(R10=\"\",\"\",Eckdaten!$A$2-T10+1)","v":34},17,{"$f":"IF(V10=\"\",\"\",V10+(W10*Eckdaten!$A$9))","v":47.16},47.16,null,{"$f":"IF(V10=\"\",\"\",Eckdaten!$A$2-Y10+1)","v":43},8,34.72,{"$f":"IF(Tabelle1!$Z10=\"\",\"\",Eckdaten!$A$2-Tabelle1!$AB10+1)","v":35},16,null,{"$f":"IF(Tabelle1!$AC10=\"\",\"\",Eckdaten!$A$2-AE10+1)","v":""},"",{"$f":"SUM(Tabelle1!$S10,Tabelle1!$P10,Tabelle1!$M10,Tabelle1!$J10,Tabelle1!$G10,Tabelle1!$D10,AA10,AD10,X10)","v":265},14]
["7M","Stefan Obergruber",26.67,{"$f":"IF(Tabelle1!$C11=\"\",\"\",Eckdaten!$A$2-Tabelle1!$E11+1)","v":43},8,26.05,{"$f":"IF(Tabelle1!$F11=\"\",\"\",Eckdaten!$A$2-Tabelle1!$H11+1)","v":32},19,null,{"$f":"IF(Tabelle1!$I11=\"\",\"\",Eckdaten!$A$2-K11+1)","v":""},"",21.1,{"$f":"IF(L11=\"\",\"\",Eckdaten!$A$2-N11+1)","v":36},15,28.17,{"$f":"IF(Tabelle1!$O11=\"\",\"\",Eckdaten!$A$2-Q11+1)","v":40},11,14.57,{"$f":"IF(R11=\"\",\"\",Eckdaten!$A$2-T11+1)","v":35},{"$f":"IF(R11=0,\"\",RANK(R11,$R$5:$R$54,1))","v":16},{"$f":"IF(V11=\"\",\"\",V11+(W11*Eckdaten!$A$9))","v":38.200000000000003},38.200000000000003,null,{"$f":"IF(V11=\"\",\"\",Eckdaten!$A$2-Y11+1)","v":47},4,25.86,{"$f":"IF(Tabelle1!$Z11=\"\",\"\",Eckdaten!$A$2-Tabelle1!$AB11+1)","v":45},6,null,{"$f":"IF(Tabelle1!$AC11=\"\",\"\",Eckdaten!$A$2-AE11+1)","v":""},"",{"$f":"SUM(Tabelle1!$S11,Tabelle1!$P11,Tabelle1!$M11,Tabelle1!$J11,Tabelle1!$G11,Tabelle1!$D11,AA11,AD11,X11)","v":278},13]
["8M","Kastl Max",32.840000000000003,{"$f":"IF(Tabelle1!$C12=\"\",\"\",Eckdaten!$A$2-Tabelle1!$E12+1)","v":37},14,21.24,{"$f":"IF(Tabelle1!$F12=\"\",\"\",Eckdaten!$A$2-Tabelle1!$H12+1)","v":40},11,null,{"$f":"IF(Tabelle1!$I12=\"\",\"\",Eckdaten!$A$2-K12+1)","v":""},"",24.6,{"$f":"IF(L12=\"\",\"\",Eckdaten!$A$2-N12+1)","v":47},4,38.299999999999997,{"$f":"IF(Tabelle1!$O12=\"\",\"\",Eckdaten!$A$2-Q12+1)","v":47},4,13.25,{"$f":"IF(R12=\"\",\"\",Eckdaten!$A$2-T12+1)","v":41},10,{"$f":"IF(V12=\"\",\"\",V12+(W12*Eckdaten!$A$9))","v":38.159999999999997},38.159999999999997,null,{"$f":"IF(V12=\"\",\"\",Eckdaten!$A$2-Y12+1)","v":48},3,25.93,{"$f":"IF(Tabelle1!$Z12=\"\",\"\",Eckdaten!$A$2-Tabelle1!$AB12+1)","v":44},7,null,{"$f":"IF(Tabelle1!$AC12=\"\",\"\",Eckdaten!$A$2-AE12+1)","v":""},"",{"$f":"SUM(Tabelle1!$S12,Tabelle1!$P12,Tabelle1!$M12,Tabelle1!$J12,Tabelle1!$G12,Tabelle1!$D12,AA12,AD12,X12)","v":304},5]
["9M","Marco Hofstätter",25.14,{"$f":"IF(Tabelle1!$C13=\"\",\"\",Eckdaten!$A$2-Tabelle1!$E13+1)","v":48},3,17.27,{"$f":"IF(Tabelle1!$F13=\"\",\"\",Eckdaten!$A$2-Tabelle1!$H13+1)","v":50},1,null,{"$f":"IF(Tabelle1!$I13=\"\",\"\",Eckdaten!$A$2-K13+1)","v":""},"",24.3,{"$f":"IF(L13=\"\",\"\",Eckdaten!$A$2-N13+1)","v":45},6,46.35,{"$f":"IF(Tabelle1!$O13=\"\",\"\",Eckdaten!$A$2-Q13+1)","v":50},1,10.57,{"$f":"IF(R13=\"\",\"\",Eckdaten!$A$2-T13+1)","v":49},2,{"$f":"IF(V13=\"\",\"\",V13+(W13*Eckdaten!$A$9))","v":48.58},48.58,null,{"$f":"IF(V13=\"\",\"\",Eckdaten!$A$2-Y13+1)","v":42},9,35.130000000000003,{"$f":"IF(Tabelle1!$Z13=\"\",\"\",Eckdaten!$A$2-Tabelle1!$AB13+1)","v":34},17,null,{"$f":"IF(Tabelle1!$AC13=\"\",\"\",Eckdaten!$A$2-AE13+1)","v":""},"",{"$f":"SUM(Tabelle1!$S13,Tabelle1!$P13,Tabelle1!$M13,Tabelle1!$J13,Tabelle1!$G13,Tabelle1!$D13,AA13,AD13,X13)","v":318},3]
["10M",null,null,{"$f":"IF(Tabelle1!$C14=\"\",\"\",Eckdaten!$A$2-Tabelle1!$E14+1)","v":""},"",null,{"$f":"IF(Tabelle1!$F14=\"\",\"\",Eckdaten!$A$2-Tabelle1!$H14+1)","v":""},"",null,{"$f":"IF(Tabelle1!$I14=\"\",\"\",Eckdaten!$A$2-K14+1)","v":""},"",null,{"$f":"IF(L14=\"\",\"\",Eckdaten!$A$2-N14+1)","v":""},"",null,{"$f":"IF(Tabelle1!$O14=\"\",\"\",Eckdaten!$A$2-Q14+1)","v":""},"",null,{"$f":"IF(R14=\"\",\"\",Eckdaten!$A$2-T14+1)","v":""},"",{"$f":"IF(V14=\"\",\"\",V14+(W14*Eckdaten!$A$9))","v":""},null,null,{"$f":"IF(V14=\"\",\"\",Eckdaten!$A$2-Y14+1)","v":""},"",null,{"$f":"IF(Tabelle1!$Z14=\"\",\"\",Eckdaten!$A$2-Tabelle1!$AB14+1)","v":""},"",null,{"$f":"IF(Tabelle1!$AC14=\"\",\"\",Eckdaten!$A$2-AE14+1)","v":""},"",{"$f":"SUM(Tabelle1!$S14,Tabelle1!$P14,Tabelle1!$M14,Tabelle1!$J14,Tabelle1!$G14,Tabelle1!$D14,AA14,AD14,X14)","v":0},""]
["11M","Christian Pühringer",47.11,{"$f":"IF(Tabelle1!$C15=\"\",\"\",Eckdaten!$A$2-Tabelle1!$E15+1)","v":32},19,25.98,{"$f":"IF(Tabelle1!$F15=\"\",\"\",Eckdaten!$A$2-Tabelle1!$H15+1)","v":33},18,null,{"$f":"IF(Tabelle1!$I15=\"\",\"\",Eckdaten!$A$2-K15+1)","v":""},"",24.8,{"$f":"IF(L15=\"\",\"\",Eckdaten!$A$2-N15+1)","v":48},3,34.82,{"$f":"IF(Tabelle1!$O15=\"\",\"\",Eckdaten!$A$2-Q15+1)","v":44},7,23.83,{"$f":"IF(R15=\"\",\"\",Eckdaten!$A$2-T15+1)","v":32},19,{"$f":"IF(V15=\"\",\"\",V15+(W15*Eckdaten!$A$9))","v":70.13},70.13,null,{"$f":"IF(V15=\"\",\"\",Eckdaten!$A$2-Y15+1)","v":32},19,26.6,{"$f":"IF(Tabelle1!$Z15=\"\",\"\",Eckdaten!$A$2-Tabelle1!$AB15+1)","v":43},8,null,{"$f":"IF(Tabelle1!$AC15=\"\",\"\",Eckdaten!$A$2-AE15+1)","v":""},"",{"$f":"SUM(Tabelle1!$S15,Tabelle1!$P15,Tabelle1!$M15,Tabelle1!$J15,Tabelle1!$G15,Tabelle1!$D15,AA15,AD15,X15)","v":264},16]
["12M",null,null,{"$f":"IF(Tabelle1!$C16=\"\",\"\",Eckdaten!$A$2-Tabelle1!$E16+1)","v":""},"",null,{"$f":"IF(Tabelle1!$F16=\"\",\"\",Eckdaten!$A$2-Tabelle1!$H16+1)","v":""},"",null,{"$f":"IF(Tabelle1!$I16=\"\",\"\",Eckdaten!$A$2-K16+1)","v":""},"",null,{"$f":"IF(L16=\"\",\"\",Eckdaten!$A$2-N16+1)","v":""},"",null,{"$f":"IF(Tabelle1!$O16=\"\",\"\",Eckdaten!$A$2-Q16+1)","v":""},"",null,{"$f":"IF(R16=\"\",\"\",Eckdaten!$A$2-T16+1)","v":""},"",{"$f":"IF(V16=\"\",\"\",V16+(W16*Eckdaten!$A$9))","v":""},null,null,{"$f":"IF(V16=\"\",\"\",Eckdaten!$A$2-Y16+1)","v":""},"",null,{"$f":"IF(Tabelle1!$Z16=\"\",\"\",Eckdaten!$A$2-Tabelle1!$AB16+1)","v":""},"",null,{"$f":"IF(Tabelle1!$AC16=\"\",\"\",Eckdaten!$A$2-AE16+1)","v":""},"",{"$f":"SUM(Tabelle1!$S16,Tabelle1!$P16,Tabelle1!$M16,Tabelle1!$J16,Tabelle1!$G16,Tabelle1!$D16,AA16,AD16,X16)","v":0},""]
["13M","Thomas Lindorfer",25.19,{"$f":"IF(Tabelle1!$C17=\"\",\"\",Eckdaten!$A$2-Tabelle1!$E17+1)","v":47},4,18.95,{"$f":"IF(Tabelle1!$F17=\"\",\"\",Eckdaten!$A$2-Tabelle1!$H17+1)","v":46},5,null,{"$f":"IF(Tabelle1!$I17=\"\",\"\",Eckdaten!$A$2-K17+1)","v":""},"",23.3,{"$f":"IF(L17=\"\",\"\",Eckdaten!$A$2-N17+1)","v":41},10,30.14,{"$f":"IF(Tabelle1!$O17=\"\",\"\",Eckdaten!$A$2-Q17+1)","v":42},9,10.96,{"$f":"IF(R17=\"\",\"\",Eckdaten!$A$2-T17+1)","v":48},3,{"$f":"IF(V17=\"\",\"\",V17+(W17*Eckdaten!$A$9))","v":43.42},43.42,null,{"$f":"IF(V17=\"\",\"\",Eckdaten!$A$2-Y17+1)","v":45},6,22.76,{"$f":"IF(Tabelle1!$Z17=\"\",\"\",Eckdaten!$A$2-Tabelle1!$AB17+1)","v":49},2,null,{"$f":"IF(Tabelle1!$AC17=\"\",\"\",Eckdaten!$A$2-AE17+1)","v":""},"",{"$f":"SUM(Tabelle1!$S17,Tabelle1!$P17,Tabelle1!$M17,Tabelle1!$J17,Tabelle1!$G17,Tabelle1!$D17,AA17,AD17,X17)","v":318},3]
["14M","Günther Pichler",32.03,{"$f":"IF(Tabelle1!$C18=\"\",\"\",Eckdaten!$A$2-Tabelle1!$E18+1)","v":38},13,22.5,{"$f":"IF(Tabelle1!$F18=\"\",\"\",Eckdaten!$A$2-Tabelle1!$H18+1)","v":35},16,null,{"$f":"IF(Tabelle1!$I18=\"\",\"\",Eckdaten!$A$2-K18+1)","v":""},"",24.4,{"$f":"IF(L18=\"\",\"\",Eckdaten!$A$2-N18+1)","v":46},5,12.16,{"$f":"IF(Tabelle1!$O18=\"\",\"\",Eckdaten!$A$2-Q18+1)","v":32},19,14.2,{"$f":"IF(R18=\"\",\"\",Eckdaten!$A$2-T18+1)","v":36},15,{"$f":"IF(V18=\"\",\"\",V18+(W18*Eckdaten!$A$9))","v":57.65},57.65,null,{"$f":"IF(V18=\"\",\"\",Eckdaten!$A$2-Y18+1)","v":36},15,46.95,{"$f":"IF(Tabelle1!$Z18=\"\",\"\",Eckdaten!$A$2-Tabelle1!$AB18+1)","v":33},18,null,{"$f":"IF(Tabelle1!$AC18=\"\",\"\",Eckdaten!$A$2-AE18+1)","v":""},"",{"$f":"SUM(Tabelle1!$S18,Tabelle1!$P18,Tabelle1!$M18,Tabelle1!$J18,Tabelle1!$G18,Tabelle1!$D18,AA18,AD18,X18)","v":256},17]
["15M","Dominik Engleder",25.55,{"$f":"IF(Tabelle1!$C19=\"\",\"\",Eckdaten!$A$2-Tabelle1!$E19+1)","v":46},5,18.5,{"$f":"IF(Tabelle1!$F19=\"\",\"\",Eckdaten!$A$2-Tabelle1!$H19+1)","v":47},4,null,{"$f":"IF(Tabelle1!$I19=\"\",\"\",Eckdaten!$A$2-K19+1)","v":""},"",23.4,{"$f":"IF(L19=\"\",\"\",Eckdaten!$A$2-N19+1)","v":43},8,40.380000000000003,{"$f":"IF(Tabelle1!$O19=\"\",\"\",Eckdaten!$A$2-Q19+1)","v":48},3,10.41,{"$f":"IF(R19=\"\",\"\",Eckdaten!$A$2-T19+1)","v":50},1,{"$f":"IF(V19=\"\",\"\",V19+(W19*Eckdaten!$A$9))","v":35.81},35.81,null,{"$f":"IF(V19=\"\",\"\",Eckdaten!$A$2-Y19+1)","v":49},2,27.23,{"$f":"IF(Tabelle1!$Z19=\"\",\"\",Eckdaten!$A$2-Tabelle1!$AB19+1)","v":42},9,null,{"$f":"IF(Tabelle1!$AC19=\"\",\"\",Eckdaten!$A$2-AE19+1)","v":""},"",{"$f":"SUM(Tabelle1!$S19,Tabelle1!$P19,Tabelle1!$M19,Tabelle1!$J19,Tabelle1!$G19,Tabelle1!$D19,AA19,AD19,X19)","v":325},1]
["16M","Markus Kraml",40.28,{"$f":"IF(Tabelle1!$C20=\"\",\"\",Eckdaten!$A$2-Tabelle1!$E20+1)","v":33},18,22.13,{"$f":"IF(Tabelle1!$F20=\"\",\"\",Eckdaten!$A$2-Tabelle1!$H20+1)","v":36},15,null,{"$f":"IF(Tabelle1!$I20=\"\",\"\",Eckdaten!$A$2-K20+1)","v":""},"",22.8,{"$f":"IF(L20=\"\",\"\",Eckdaten!$A$2-N20+1)","v":39},12,12.68,{"$f":"IF(Tabelle1!$O20=\"\",\"\",Eckdaten!$A$2-Q20+1)","v":33},18,18.29,{"$f":"IF(R20=\"\",\"\",Eckdaten!$A$2-T20+1)","v":33},18,{"$f":"IF(V20=\"\",\"\",V20+(W20*Eckdaten!$A$9))","v":53.59},53.59,null,{"$f":"IF(V20=\"\",\"\",Eckdaten!$A$2-Y20+1)","v":38},13,34.49,{"$f":"IF(Tabelle1!$Z20=\"\",\"\",Eckdaten!$A$2-Tabelle1!$AB20+1)","v":36},15,null,{"$f":"IF(Tabelle1!$AC20=\"\",\"\",Eckdaten!$A$2-AE20+1)","v":""},"",{"$f":"SUM(Tabelle1!$S20,Tabelle1!$P20,Tabelle1!$M20,Tabelle1!$J20,Tabelle1!$G20,Tabelle1!$D20,AA20,AD20,X20)","v":248},19]
["17M","Christian Natschläger",35.5,{"$f":"IF(Tabelle1!$C21=\"\",\"\",Eckdaten!$A$2-Tabelle1!$E21+1)","v":35},16,21.42,{"$f":"IF(Tabelle1!$F21=\"\",\"\",Eckdaten!$A$2-Tabelle1!$H21+1)","v":38},13,null,{"$f":"IF(Tabelle1!$I21=\"\",\"\",Eckdaten!$A$2-K21+1)","v":""},"",23.4,{"$f":"IF(L21=\"\",\"\",Eckdaten!$A$2-N21+1)","v":43},8,24.46,{"$f":"IF(Tabelle1!$O21=\"\",\"\",Eckdaten!$A$2-Q21+1)","v":35},16,13.54,{"$f":"IF(R21=\"\",\"\",Eckdaten!$A$2-T21+1)","v":40},11,{"$f":"IF(V21=\"\",\"\",V21+(W21*Eckdaten!$A$9))","v":63.03},63.03,null,{"$f":"IF(V21=\"\",\"\",Eckdaten!$A$2-Y21+1)","v":34},17,27.48,{"$f":"IF(Tabelle1!$Z21=\"\",\"\",Eckdaten!$A$2-Tabelle1!$AB21+1)","v":40},11,null,{"$f":"IF(Tabelle1!$AC21=\"\",\"\",Eckdaten!$A$2-AE21+1)","v":""},"",{"$f":"SUM(Tabelle1!$S21,Tabelle1!$P21,Tabelle1!$M21,Tabelle1!$J21,Tabelle1!$G21,Tabelle1!$D21,AA21,AD21,X21)","v":265},14]
["18M","Erich Haider",28.1,{"$f":"IF(Tabelle1!$C22=\"\",\"\",Eckdaten!$A$2-Tabelle1!$E22+1)","v":40},11,19.88,{"$f":"IF(Tabelle1!$F22=\"\",\"\",Eckdaten!$A$2-Tabelle1!$H22+1)","v":42},9,null,{"$f":"IF(Tabelle1!$I22=\"\",\"\",Eckdaten!$A$2-K22+1)","v":""},"",23.1,{"$f":"IF(L22=\"\",\"\",Eckdaten!$A$2-N22+1)","v":40},11,37.549999999999997,{"$f":"IF(Tabelle1!$O22=\"\",\"\",Eckdaten!$A$2-Q22+1)","v":45},6,12.39,{"$f":"IF(R22=\"\",\"\",Eckdaten!$A$2-T22+1)","v":45},6,{"$f":"IF(V22=\"\",\"\",V22+(W22*Eckdaten!$A$9))","v":52.15},52.15,null,{"$f":"IF(V22=\"\",\"\",Eckdaten!$A$2-Y22+1)","v":39},12,32.01,{"$f":"IF(Tabelle1!$Z22=\"\",\"\",Eckdaten!$A$2-Tabelle1!$AB22+1)","v":37},14,null,{"$f":"IF(Tabelle1!$AC22=\"\",\"\",Eckdaten!$A$2-AE22+1)","v":""},"",{"$f":"SUM(Tabelle1!$S22,Tabelle1!$P22,Tabelle1!$M22,Tabelle1!$J22,Tabelle1!$G22,Tabelle1!$D22,AA22,AD22,X22)","v":288},9]
["19M","Bastian Enzenhofer",25.97,{"$f":"IF(Tabelle1!$C23=\"\",\"\",Eckdaten!$A$2-Tabelle1!$E23+1)","v":45},6,24.63,{"$f":"IF(Tabelle1!$F23=\"\",\"\",Eckdaten!$A$2-Tabelle1!$H23+1)","v":34},17,null,{"$f":"IF(Tabelle1!$I23=\"\",\"\",Eckdaten!$A$2-K23+1)","v":""},"",20.8,{"$f":"IF(L23=\"\",\"\",Eckdaten!$A$2-N23+1)","v":35},16,29.07,{"$f":"IF(Tabelle1!$O23=\"\",\"\",Eckdaten!$A$2-Q23+1)","v":41},10,12.85,{"$f":"IF(R23=\"\",\"\",Eckdaten!$A$2-T23+1)","v":42},9,{"$f":"IF(V23=\"\",\"\",V23+(W23*Eckdaten!$A$9))","v":39.799999999999997},39.799999999999997,null,{"$f":"IF(V23=\"\",\"\",Eckdaten!$A$2-Y23+1)","v":46},5,27.36,{"$f":"IF(Tabelle1!$Z23=\"\",\"\",Eckdaten!$A$2-Tabelle1!$AB23+1)","v":41},10,null,{"$f":"IF(Tabelle1!$AC23=\"\",\"\",Eckdaten!$A$2-AE23+1)","v":""},"",{"$f":"SUM(Tabelle1!$S23,Tabelle1!$P23,Tabelle1!$M23,Tabelle1!$J23,Tabelle1!$G23,Tabelle1!$D23,AA23,AD23,X23)","v":284},10]
["20M","Patrick Martha",26.29,{"$f":"IF(Tabelle1!$C24=\"\",\"\",Eckdaten!$A$2-Tabelle1!$E24+1)","v":44},7,20.89,{"$f":"IF(Tabelle1!$F24=\"\",\"\",Eckdaten!$A$2-Tabelle1!$H24+1)","v":41},10,null,{"$f":"IF(Tabelle1!$I24=\"\",\"\",Eckdaten!$A$2-K24+1)","v":""},"",25,{"$f":"IF(L24=\"\",\"\",Eckdaten!$A$2-N24+1)","v":49},2,27.12,{"$f":"IF(Tabelle1!$O24=\"\",\"\",Eckdaten!$A$2-Q24+1)","v":38},13,13.56,{"$f":"IF(R24=\"\",\"\",Eckdaten!$A$2-T24+1)","v":39},12,{"$f":"IF(V24=\"\",\"\",V24+(W24*Eckdaten!$A$9))","v":46.51},46.51,null,{"$f":"IF(V24=\"\",\"\",Eckdaten!$A$2-Y24+1)","v":44},7,31.85,{"$f":"IF(Tabelle1!$Z24=\"\",\"\",Eckdaten!$A$2-Tabelle1!$AB24+1)","v":38},13,null,{"$f":"IF(Tabelle1!$AC24=\"\",\"\",Eckdaten!$A$2-AE24+1)","v":""},"",{"$f":"SUM(Tabelle1!$S24,Tabelle1!$P24,Tabelle1!$M24,Tabelle1!$J24,Tabelle1!$G24,Tabelle1!$D24,AA24,AD24,X24)","v":293},8]
["21M","Mario Gahleitern",24.11,{"$f":"IF(Tabelle1!$C25=\"\",\"\",Eckdaten!$A$2-Tabelle1!$E25+1)","v":50},1,21.93,{"$f":"IF(Tabelle1!$F25=\"\",\"\",Eckdaten!$A$2-Tabelle1!$H25+1)","v":37},14,null,{"$f":"IF(Tabelle1!$I25=\"\",\"\",Eckdaten!$A$2-K25+1)","v":""},"",22.3,{"$f":"IF(L25=\"\",\"\",Eckdaten!$A$2-N25+1)","v":37},14,26.67,{"$f":"IF(Tabelle1!$O25=\"\",\"\",Eckdaten!$A$2-Q25+1)","v":36},15,13.61,{"$f":"IF(R25=\"\",\"\",Eckdaten!$A$2-T25+1)","v":38},13,{"$f":"IF(V25=\"\",\"\",V25+(W25*Eckdaten!$A$9))","v":51.47},51.47,null,{"$f":"IF(V25=\"\",\"\",Eckdaten!$A$2-Y25+1)","v":40},11,25.56,{"$f":"IF(Tabelle1!$Z25=\"\",\"\",Eckdaten!$A$2-Tabelle1!$AB25+1)","v":46},5,null,{"$f":"IF(Tabelle1!$AC25=\"\",\"\",Eckdaten!$A$2-AE25+1)","v":""},"",{"$f":"SUM(Tabelle1!$S25,Tabelle1!$P25,Tabelle1!$M25,Tabelle1!$J25,Tabelle1!$G25,Tabelle1!$D25,AA25,AD25,X25)","v":284},10]
["22M","Kevin Raab",24.9,{"$f":"IF(Tabelle1!$C26=\"\",\"\",Eckdaten!$A$2-Tabelle1!$E26+1)","v":49},2,19.47,{"$f":"IF(Tabelle1!$F26=\"\",\"\",Eckdaten!$A$2-Tabelle1!$H26+1)","v":43},8,null,{"$f":"IF(Tabelle1!$I26=\"\",\"\",Eckdaten!$A$2-K26+1)","v":""},"",9.6999999999999993,{"$f":"IF(L26=\"\",\"\",Eckdaten!$A$2-N26+1)","v":33},18,27.91,{"$f":"IF(Tabelle1!$O26=\"\",\"\",Eckdaten!$A$2-Q26+1)","v":39},12,12.58,{"$f":"IF(R26=\"\",\"\",Eckdaten!$A$2-T26+1)","v":43},8,{"$f":"IF(V26=\"\",\"\",V26+(W26*Eckdaten!$A$9))","v":57.88},57.88,null,{"$f":"IF(V26=\"\",\"\",Eckdaten!$A$2-Y26+1)","v":35},16,29.64,{"$f":"IF(Tabelle1!$Z26=\"\",\"\",Eckdaten!$A$2-Tabelle1!$AB26+1)","v":39},12,null,{"$f":"IF(Tabelle1!$AC26=\"\",\"\",Eckdaten!$A$2-AE26+1)","v":""},"",{"$f":"SUM(Tabelle1!$S26,Tabelle1!$P26,Tabelle1!$M26,Tabelle1!$J26,Tabelle1!$G26,Tabelle1!$D26,AA26,AD26,X26)","v":281},12]
["23M",null,null,{"$f":"IF(Tabelle1!$C27=\"\",\"\",Eckdaten!$A$2-Tabelle1!$E27+1)","v":""},"",null,{"$f":"IF(Tabelle1!$F27=\"\",\"\",Eckdaten!$A$2-Tabelle1!$H27+1)","v":""},"",null,{"$f":"IF(Tabelle1!$I27=\"\",\"\",Eckdaten!$A$2-K27+1)","v":""},"",null,{"$f":"IF(L27=\"\",\"\",Eckdaten!$A$2-N27+1)","v":""},"",null,{"$f":"IF(Tabelle1!$O27=\"\",\"\",Eckdaten!$A$2-Q27+1)","v":""},"",null,{"$f":"IF(R27=\"\",\"\",Eckdaten!$A$2-T27+1)","v":""},"",{"$f":"IF(V27=\"\",\"\",V27+(W27*Eckdaten!$A$9))","v":""},null,null,{"$f":"IF(V27=\"\",\"\",Eckdaten!$A$2-Y27+1)","v":""},"",null,{"$f":"IF(Tabelle1!$Z27=\"\",\"\",Eckdaten!$A$2-Tabelle1!$AB27+1)","v":""},"",null,{"$f":"IF(Tabelle1!$AC27=\"\",\"\",Eckdaten!$A$2-AE27+1)","v":""},"",{"$f":"SUM(Tabelle1!$S27,Tabelle1!$P27,Tabelle1!$M27,Tabelle1!$J27,Tabelle1!$G27,Tabelle1!$D27,AA27,AD27,X27)","v":0},""]
["24M",null,null,{"$f":"IF(Tabelle1!$C28=\"\",\"\",Eckdaten!$A$2-Tabelle1!$E28+1)","v":""},"",null,{"$f":"IF(Tabelle1!$F28=\"\",\"\",Eckdaten!$A$2-Tabelle1!$H28+1)","v":""},"",null,{"$f":"IF(Tabelle1!$I28=\"\",\"\",Eckdaten!$A$2-K28+1)","v":""},"",null,{"$f":"IF(L28=\"\",\"\",Eckdaten!$A$2-N28+1)","v":""},"",null,{"$f":"IF(Tabelle1!$O28=\"\",\"\",Eckdaten!$A$2-Q28+1)","v":""},"",null,{"$f":"IF(R28=\"\",\"\",Eckdaten!$A$2-T28+1)","v":""},"",{"$f":"IF(V28=\"\",\"\",V28+(W28*Eckdaten!$A$9))","v":""},null,null,{"$f":"IF(V28=\"\",\"\",Eckdaten!$A$2-Y28+1)","v":""},"",null,{"$f":"IF(Tabelle1!$Z28=\"\",\"\",Eckdaten!$A$2-Tabelle1!$AB28+1)","v":""},"",null,{"$f":"IF(Tabelle1!$AC28=\"\",\"\",Eckdaten!$A$2-AE28+1)","v":""},"",{"$f":"SUM(Tabelle1!$S28,Tabelle1!$P28,Tabelle1!$M28,Tabelle1!$J28,Tabelle1!$G28,Tabelle1!$D28,AA28,AD28,X28)","v":0},""]
["25M",null,null,{"$f":"IF(Tabelle1!$C29=\"\",\"\",Eckdaten!$A$2-Tabelle1!$E29+1)","v":""},"",null,{"$f":"IF(Tabelle1!$F29=\"\",\"\",Eckdaten!$A$2-Tabelle1!$H29+1)","v":""},"",null,{"$f":"IF(Tabelle1!$I29=\"\",\"\",Eckdaten!$A$2-K29+1)","v":""},"",null,{"$f":"IF(L29=\"\",\"\",Eckdaten!$A$2-N29+1)","v":""},"",null,{"$f":"IF(Tabelle1!$O29=\"\",\"\",Eckdaten!$A$2-Q29+1)","v":""},"",null,{"$f":"IF(R29=\"\",\"\",Eckdaten!$A$2-T29+1)","v":""},"",{"$f":"IF(V29=\"\",\"\",V29+(W29*Eckdaten!$A$9))","v":""},null,null,{"$f":"IF(V29=\"\",\"\",Eckdaten!$A$2-Y29+1)","v":""},"",null,{"$f":"IF(Tabelle1!$Z29=\"\",\"\",Eckdaten!$A$2-Tabelle1!$AB29+1)","v":""},"",null,{"$f":"IF(Tabelle1!$AC29=\"\",\"\",Eckdaten!$A$2-AE29+1)","v":""},"",{"$f":"SUM(Tabelle1!$S29,Tabelle1!$P29,Tabelle1!$M29,Tabelle1!$J29,Tabelle1!$G29,Tabelle1!$D29,AA29,AD29,X29)","v":0},""]
["26M",null,null,{"$f":"IF(Tabelle1!$C30=\"\",\"\",Eckdaten!$A$2-Tabelle1!$E30+1)","v":""},"",null,{"$f":"IF(Tabelle1!$F30=\"\",\"\",Eckdaten!$A$2-Tabelle1!$H30+1)","v":""},"",null,{"$f":"IF(Tabelle1!$I30=\"\",\"\",Eckdaten!$A$2-K30+1)","v":""},"",null,{"$f":"IF(L30=\"\",\"\",Eckdaten!$A$2-N30+1)","v":""},"",null,{"$f":"IF(Tabelle1!$O30=\"\",\"\",Eckdaten!$A$2-Q30+1)","v":""},"",null,{"$f":"IF(R30=\"\",\"\",Eckdaten!$A$2-T30+1)","v":""},"",{"$f":"IF(V30=\"\",\"\",V30+(W30*Eckdaten!$A$9))","v":""},null,null,{"$f":"IF(V30=\"\",\"\",Eckdaten!$A$2-Y30+1)","v":""},"",null,{"$f":"IF(Tabelle1!$Z30=\"\",\"\",Eckdaten!$A$2-Tabelle1!$AB30+1)","v":""},"",null,{"$f":"IF(Tabelle1!$AC30=\"\",\"\",Eckdaten!$A$2-AE30+1)","v":""},"",{"$f":"SUM(Tabelle1!$S30,Tabelle1!$P30,Tabelle1!$M30,Tabelle1!$J30,Tabelle1!$G30,Tabelle1!$D30,AA30,AD30,X30)","v":0},""]
["27M",null,null,{"$f":"IF(Tabelle1!$C31=\"\",\"\",Eckdaten!$A$2-Tabelle1!$E31+1)","v":""},"",null,{"$f":"IF(Tabelle1!$F31=\"\",\"\",Eckdaten!$A$2-Tabelle1!$H31+1)","v":""},"",null,{"$f":"IF(Tabelle1!$I31=\"\",\"\",Eckdaten!$A$2-K31+1)","v":""},"",null,{"$f":"IF(L31=\"\",\"\",Eckdaten!$A$2-N31+1)","v":""},"",null,{"$f":"IF(Tabelle1!$O31=\"\",\"\",Eckdaten!$A$2-Q31+1)","v":""},"",null,{"$f":"IF(R31=\"\",\"\",Eckdaten!$A$2-T31+1)","v":""},"",{"$f":"IF(V31=\"\",\"\",V31+(W31*Eckdaten!$A$9))","v":""},null,null,{"$f":"IF(V31=\"\",\"\",Eckdaten!$A$2-Y31+1)","v":""},"",null,{"$f":"IF(Tabelle1!$Z31=\"\",\"\",Eckdaten!$A$2-Tabelle1!$AB31+1)","v":""},"",null,{"$f":"IF(Tabelle1!$AC31=\"\",\"\",Eckdaten!$A$2-AE31+1)","v":""},"",{"$f":"SUM(Tabelle1!$S31,Tabelle1!$P31,Tabelle1!$M31,Tabelle1!$J31,Tabelle1!$G31,Tabelle1!$D31,AA31,AD31,X31)","v":0},""]
["28M",null,null,{"$f":"IF(Tabelle1!$C32=\"\",\"\",Eckdaten!$A$2-Tabelle1!$E32+1)","v":""},"",null,{"$f":"IF(Tabelle1!$F32=\"\",\"\",Eckdaten!$A$2-Tabelle1!$H32+1)","v":""},"",null,{"$f":"IF(Tabelle1!$I32=\"\",\"\",Eckdaten!$A$2-K32+1)","v":""},"",null,{"$f":"IF(L32=\"\",\"\",Eckdaten!$A$2-N32+1)","v":""},"",null,{"$f":"IF(Tabelle1!$O32=\"\",\"\",Eckdaten!$A$2-Q32+1)","v":""},"",null,{"$f":"IF(R32=\"\",\"\",Eckdaten!$A$2-T32+1)","v":""},"",{"$f":"IF(V32=\"\",\"\",V32+(W32*Eckdaten!$A$9))","v":""},null,null,{"$f":"IF(V32=\"\",\"\",Eckdaten!$A$2-Y32+1)","v":""},"",null,{"$f":"IF(Tabelle1!$Z32=\"\",\"\",Eckdaten!$A$2-Tabelle1!$AB32+1)","v":""},"",null,{"$f":"IF(Tabelle1!$AC32=\"\",\"\",Eckdaten!$A$2-AE32+1)","v":""},"",{"$f":"SUM(Tabelle1!$S32,Tabelle1!$P32,Tabelle1!$M32,Tabelle1!$J32,Tabelle1!$G32,Tabelle1!$D32,AA32,AD32,X32)","v":0},""]
["29M",null,null,{"$f":"IF(Tabelle1!$C33=\"\",\"\",Eckdaten!$A$2-Tabelle1!$E33+1)","v":""},"",null,{"$f":"IF(Tabelle1!$F33=\"\",\"\",Eckdaten!$A$2-Tabelle1!$H33+1)","v":""},"",null,{"$f":"IF(Tabelle1!$I33=\"\",\"\",Eckdaten!$A$2-K33+1)","v":""},"",null,{"$f":"IF(L33=\"\",\"\",Eckdaten!$A$2-N33+1)","v":""},"",null,{"$f":"IF(Tabelle1!$O33=\"\",\"\",Eckdaten!$A$2-Q33+1)","v":""},"",null,{"$f":"IF(R33=\"\",\"\",Eckdaten!$A$2-T33+1)","v":""},"",{"$f":"IF(V33=\"\",\"\",V33+(W33*Eckdaten!$A$9))","v":""},null,null,{"$f":"IF(V33=\"\",\"\",Eckdaten!$A$2-Y33+1)","v":""},"",null,{"$f":"IF(Tabelle1!$Z33=\"\",\"\",Eckdaten!$A$2-Tabelle1!$AB33+1)","v":""},"",null,{"$f":"IF(Tabelle1!$AC33=\"\",\"\",Eckdaten!$A$2-AE33+1)","v":""},"",{"$f":"SUM(Tabelle1!$S33,Tabelle1!$P33,Tabelle1!$M33,Tabelle1!$J33,Tabelle1!$G33,Tabelle1!$D33,AA33,AD33,X33)","v":0},""]
["30M",null,null,{"$f":"IF(Tabelle1!$C34=\"\",\"\",Eckdaten!$A$2-Tabelle1!$E34+1)","v":""},"",null,{"$f":"IF(Tabelle1!$F34=\"\",\"\",Eckdaten!$A$2-Tabelle1!$H34+1)","v":""},"",null,{"$f":"IF(Tabelle1!$I34=\"\",\"\",Eckdaten!$A$2-K34+1)","v":""},"",null,{"$f":"IF(L34=\"\",\"\",Eckdaten!$A$2-N34+1)","v":""},"",null,{"$f":"IF(Tabelle1!$O34=\"\",\"\",Eckdaten!$A$2-Q34+1)","v":""},"",null,{"$f":"IF(R34=\"\",\"\",Eckdaten!$A$2-T34+1)","v":""},"",{"$f":"IF(V34=\"\",\"\",V34+(W34*Eckdaten!$A$9))","v":""},null,null,{"$f":"IF(V34=\"\",\"\",Eckdaten!$A$2-Y34+1)","v":""},"",null,{"$f":"IF(Tabelle1!$Z34=\"\",\"\",Eckdaten!$A$2-Tabelle1!$AB34+1)","v":""},"",null,{"$f":"IF(Tabelle1!$AC34=\"\",\"\",Eckdaten!$A$2-AE34+1)","v":""},"",{"$f":"SUM(Tabelle1!$S34,Tabelle1!$P34,Tabelle1!$M34,Tabelle1!$J34,Tabelle1!$G34,Tabelle1!$D34,AA34,AD34,X34)","v":0},""]
["31M",null,null,{"$f":"IF(Tabelle1!$C35=\"\",\"\",Eckdaten!$A$2-Tabelle1!$E35+1)","v":""},"",null,{"$f":"IF(Tabelle1!$F35=\"\",\"\",Eckdaten!$A$2-Tabelle1!$H35+1)","v":""},{"$f":"IF(F35=0,\"\",RANK(F35,$F$5:$F$54,1))","v":""},null,{"$f":"IF(Tabelle1!$I35=\"\",\"\",Eckdaten!$A$2-K35+1)","v":""},"",null,{"$f":"IF(L35=\"\",\"\",Eckdaten!$A$2-N35+1)","v":""},"",null,{"$f":"IF(Tabelle1!$O35=\"\",\"\",Eckdaten!$A$2-Q35+1)","v":""},"",null,{"$f":"IF(R35=\"\",\"\",Eckdaten!$A$2-T35+1)","v":""},"",{"$f":"IF(V35=\"\",\"\",V35+(W35*Eckdaten!$A$9))","v":""},null,null,{"$f":"IF(V35=\"\",\"\",Eckdaten!$A$2-Y35+1)","v":""},"",null,{"$f":"IF(Tabelle1!$Z35=\"\",\"\",Eckdaten!$A$2-Tabelle1!$AB35+1)","v":""},"",null,{"$f":"IF(Tabelle1!$AC35=\"\",\"\",Eckdaten!$A$2-AE35+1)","v":""},"",{"$f":"SUM(Tabelle1!$S35,Tabelle1!$P35,Tabelle1!$M35,Tabelle1!$J35,Tabelle1!$G35,Tabelle1!$D35,AA35,AD35,X35)","v":0},{"$f":"IF(AF35=0,\"\",RANK(AF35,$AF$5:$AF$54))","v":""}]
["32M",null,null,{"$f":"IF(Tabelle1!$C36=\"\",\"\",Eckdaten!$A$2-Tabelle1!$E36+1)","v":""},"",null,{"$f":"IF(Tabelle1!$F36=\"\",\"\",Eckdaten!$A$2-Tabelle1!$H36+1)","v":""},"",null,{"$f":"IF(Tabelle1!$I36=\"\",\"\",Eckdaten!$A$2-K36+1)","v":""},"",null,{"$f":"IF(L36=\"\",\"\",Eckdaten!$A$2-N36+1)","v":""},"",null,{"$f":"IF(Tabelle1!$O36=\"\",\"\",Eckdaten!$A$2-Q36+1)","v":""},"",null,{"$f":"IF(R36=\"\",\"\",Eckdaten!$A$2-T36+1)","v":""},"",{"$f":"IF(V36=\"\",\"\",V36+(W36*Eckdaten!$A$9))","v":""},null,null,{"$f":"IF(V36=\"\",\"\",Eckdaten!$A$2-Y36+1)","v":""},"",null,{"$f":"IF(Tabelle1!$Z36=\"\",\"\",Eckdaten!$A$2-Tabelle1!$AB36+1)","v":""},"",null,{"$f":"IF(Tabelle1!$AC36=\"\",\"\",Eckdaten!$A$2-AE36+1)","v":""},"",{"$f":"SUM(Tabelle1!$S36,Tabelle1!$P36,Tabelle1!$M36,Tabelle1!$J36,Tabelle1!$G36,Tabelle1!$D36,AA36,AD36,X36)","v":0},""]
["33M",null,null,{"$f":"IF(Tabelle1!$C37=\"\",\"\",Eckdaten!$A$2-Tabelle1!$E37+1)","v":""},"",null,{"$f":"IF(Tabelle1!$F37=\"\",\"\",Eckdaten!$A$2-Tabelle1!$H37+1)","v":""},"",null,{"$f":"IF(Tabelle1!$I37=\"\",\"\",Eckdaten!$A$2-K37+1)","v":""},"",null,{"$f":"IF(L37=\"\",\"\",Eckdaten!$A$2-N37+1)","v":""},"",null,{"$f":"IF(Tabelle1!$O37=\"\",\"\",Eckdaten!$A$2-Q37+1)","v":""},"",null,{"$f":"IF(R37=\"\",\"\",Eckdaten!$A$2-T37+1)","v":""},"",{"$f":"IF(V37=\"\",\"\",V37+(W37*Eckdaten!$A$9))","v":""},null,null,{"$f":"IF(V37=\"\",\"\",Eckdaten!$A$2-Y37+1)","v":""},{"$f":"IF(ISERROR(IF(U37=0,\"\",RANK(U37,$U$5:$U$54,1))),\"\",IF(U37=0,\"\",RANK(U37,$U$5:$U$54,1)))","v":""},null,{"$f":"IF(Tabelle1!$Z37=\"\",\"\",Eckdaten!$A$2-Tabelle1!$AB37+1)","v":""},"",null,{"$f":"IF(Tabelle1!$AC37=\"\",\"\",Eckdaten!$A$2-AE37+1)","v":""},"",{"$f":"SUM(Tabelle1!$S37,Tabelle1!$P37,Tabelle1!$M37,Tabelle1!$J37,Tabelle1!$G37,Tabelle1!$D37,AA37,AD37,X37)","v":0},""]
["34M",null,null,{"$f":"IF(Tabelle1!$C38=\"\",\"\",Eckdaten!$A$2-Tabelle1!$E38+1)","v":""},"",null,{"$f":"IF(Tabelle1!$F38=\"\",\"\",Eckdaten!$A$2-Tabelle1!$H38+1)","v":""},"",null,{"$f":"IF(Tabelle1!$I38=\"\",\"\",Eckdaten!$A$2-K38+1)","v":""},"",null,{"$f":"IF(L38=\"\",\"\",Eckdaten!$A$2-N38+1)","v":""},"",null,{"$f":"IF(Tabelle1!$O38=\"\",\"\",Eckdaten!$A$2-Q38+1)","v":""},"",null,{"$f":"IF(R38=\"\",\"\",Eckdaten!$A$2-T38+1)","v":""},"",{"$f":"IF(V38=\"\",\"\",V38+(W38*Eckdaten!$A$9))","v":""},null,null,{"$f":"IF(V38=\"\",\"\",Eckdaten!$A$2-Y38+1)","v":""},"",null,{"$f":"IF(Tabelle1!$Z38=\"\",\"\",Eckdaten!$A$2-Tabelle1!$AB38+1)","v":""},"",null,{"$f":"IF(Tabelle1!$AC38=\"\",\"\",Eckdaten!$A$2-AE38+1)","v":""},"",{"$f":"SUM(Tabelle1!$S38,Tabelle1!$P38,Tabelle1!$M38,Tabelle1!$J38,Tabelle1!$G38,Tabelle1!$D38,AA38,AD38,X38)","v":0},""]
["35M",null,null,{"$f":"IF(Tabelle1!$C39=\"\",\"\",Eckdaten!$A$2-Tabelle1!$E39+1)","v":""},"",null,{"$f":"IF(Tabelle1!$F39=\"\",\"\",Eckdaten!$A$2-Tabelle1!$H39+1)","v":""},"",null,{"$f":"IF(Tabelle1!$I39=\"\",\"\",Eckdaten!$A$2-K39+1)","v":""},"",null,{"$f":"IF(L39=\"\",\"\",Eckdaten!$A$2-N39+1)","v":""},"",null,{"$f":"IF(Tabelle1!$O39=\"\",\"\",Eckdaten!$A$2-Q39+1)","v":""},"",null,{"$f":"IF(R39=\"\",\"\",Eckdaten!$A$2-T39+1)","v":""},"",{"$f":"IF(V39=\"\",\"\",V39+(W39*Eckdaten!$A$9))","v":""},null,null,{"$f":"IF(V39=\"\",\"\",Eckdaten!$A$2-Y39+1)","v":""},"",null,{"$f":"IF(Tabelle1!$Z39=\"\",\"\",Eckdaten!$A$2-Tabelle1!$AB39+1)","v":""},"",null,{"$f":"IF(Tabelle1!$AC39=\"\",\"\",Eckdaten!$A$2-AE39+1)","v":""},"",{"$f":"SUM(Tabelle1!$S39,Tabelle1!$P39,Tabelle1!$M39,Tabelle1!$J39,Tabelle1!$G39,Tabelle1!$D39,AA39,AD39,X39)","v":0},""]
["36M",null,null,{"$f":"IF(Tabelle1!$C40=\"\",\"\",Eckdaten!$A$2-Tabelle1!$E40+1)","v":""},"",null,{"$f":"IF(Tabelle1!$F40=\"\",\"\",Eckdaten!$A$2-Tabelle1!$H40+1)","v":""},"",null,{"$f":"IF(Tabelle1!$I40=\"\",\"\",Eckdaten!$A$2-K40+1)","v":""},"",null,{"$f":"IF(L40=\"\",\"\",Eckdaten!$A$2-N40+1)","v":""},"",null,{"$f":"IF(Tabelle1!$O40=\"\",\"\",Eckdaten!$A$2-Q40+1)","v":""},"",null,{"$f":"IF(R40=\"\",\"\",Eckdaten!$A$2-T40+1)","v":""},"",{"$f":"IF(V40=\"\",\"\",V40+(W40*Eckdaten!$A$9))","v":""},null,null,{"$f":"IF(V40=\"\",\"\",Eckdaten!$A$2-Y40+1)","v":""},"",null,{"$f":"IF(Tabelle1!$Z40=\"\",\"\",Eckdaten!$A$2-Tabelle1!$AB40+1)","v":""},"",null,{"$f":"IF(Tabelle1!$AC40=\"\",\"\",Eckdaten!$A$2-AE40+1)","v":""},"",{"$f":"SUM(Tabelle1!$S40,Tabelle1!$P40,Tabelle1!$M40,Tabelle1!$J40,Tabelle1!$G40,Tabelle1!$D40,AA40,AD40,X40)","v":0},""]
["37M",null,null,{"$f":"IF(Tabelle1!$C41=\"\",\"\",Eckdaten!$A$2-Tabelle1!$E41+1)","v":""},"",null,{"$f":"IF(Tabelle1!$F41=\"\",\"\",Eckdaten!$A$2-Tabelle1!$H41+1)","v":""},"",null,{"$f":"IF(Tabelle1!$I41=\"\",\"\",Eckdaten!$A$2-K41+1)","v":""},"",null,{"$f":"IF(L41=\"\",\"\",Eckdaten!$A$2-N41+1)","v":""},"",null,{"$f":"IF(Tabelle1!$O41=\"\",\"\",Eckdaten!$A$2-Q41+1)","v":""},"",null,{"$f":"IF(R41=\"\",\"\",Eckdaten!$A$2-T41+1)","v":""},"",{"$f":"IF(V41=\"\",\"\",V41+(W41*Eckdaten!$A$9))","v":""},null,null,{"$f":"IF(V41=\"\",\"\",Eckdaten!$A$2-Y41+1)","v":""},"",null,{"$f":"IF(Tabelle1!$Z41=\"\",\"\",Eckdaten!$A$2-Tabelle1!$AB41+1)","v":""},"",null,{"$f":"IF(Tabelle1!$AC41=\"\",\"\",Eckdaten!$A$2-AE41+1)","v":""},"",{"$f":"SUM(Tabelle1!$S41,Tabelle1!$P41,Tabelle1!$M41,Tabelle1!$J41,Tabelle1!$G41,Tabelle1!$D41,AA41,AD41,X41)","v":0},""]
["38M",null,null,{"$f":"IF(Tabelle1!$C42=\"\",\"\",Eckdaten!$A$2-Tabelle1!$E42+1)","v":""},"",null,{"$f":"IF(Tabelle1!$F42=\"\",\"\",Eckdaten!$A$2-Tabelle1!$H42+1)","v":""},"",null,{"$f":"IF(Tabelle1!$I42=\"\",\"\",Eckdaten!$A$2-K42+1)","v":""},"",null,{"$f":"IF(L42=\"\",\"\",Eckdaten!$A$2-N42+1)","v":""},"",null,{"$f":"IF(Tabelle1!$O42=\"\",\"\",Eckdaten!$A$2-Q42+1)","v":""},"",null,{"$f":"IF(R42=\"\",\"\",Eckdaten!$A$2-T42+1)","v":""},"",{"$f":"IF(V42=\"\",\"\",V42+(W42*Eckdaten!$A$9))","v":""},null,null,{"$f":"IF(V42=\"\",\"\",Eckdaten!$A$2-Y42+1)","v":""},"",null,{"$f":"IF(Tabelle1!$Z42=\"\",\"\",Eckdaten!$A$2-Tabelle1!$AB42+1)","v":""},"",null,{"$f":"IF(Tabelle1!$AC42=\"\",\"\",Eckdaten!$A$2-AE42+1)","v":""},"",{"$f":"SUM(Tabelle1!$S42,Tabelle1!$P42,Tabelle1!$M42,Tabelle1!$J42,Tabelle1!$G42,Tabelle1!$D42,AA42,AD42,X42)","v":0},""]
["39M",null,null,{"$f":"IF(Tabelle1!$C43=\"\",\"\",Eckdaten!$A$2-Tabelle1!$E43+1)","v":""},"",null,{"$f":"IF(Tabelle1!$F43=\"\",\"\",Eckdaten!$A$2-Tabelle1!$H43+1)","v":""},"",null,{"$f":"IF(Tabelle1!$I43=\"\",\"\",Eckdaten!$A$2-K43+1)","v":""},"",null,{"$f":"IF(L43=\"\",\"\",Eckdaten!$A$2-N43+1)","v":""},"",null,{"$f":"IF(Tabelle1!$O43=\"\",\"\",Eckdaten!$A$2-Q43+1)","v":""},"",null,{"$f":"IF(R43=\"\",\"\",Eckdaten!$A$2-T43+1)","v":""},"",{"$f":"IF(V43=\"\",\"\",V43+(W43*Eckdaten!$A$9))","v":""},null,null,{"$f":"IF(V43=\"\",\"\",Eckdaten!$A$2-Y43+1)","v":""},"",null,{"$f":"IF(Tabelle1!$Z43=\"\",\"\",Eckdaten!$A$2-Tabelle1!$AB43+1)","v":""},"",null,{"$f":"IF(Tabelle1!$AC43=\"\",\"\",Eckdaten!$A$2-AE43+1)","v":""},"",{"$f":"SUM(Tabelle1!$S43,Tabelle1!$P43,Tabelle1!$M43,Tabelle1!$J43,Tabelle1!$G43,Tabelle1!$D43,AA43,AD43,X43)","v":0},""]
["40M",null,null,{"$f":"IF(Tabelle1!$C44=\"\",\"\",Eckdaten!$A$2-Tabelle1!$E44+1)","v":""},"",null,{"$f":"IF(Tabelle1!$F44=\"\",\"\",Eckdaten!$A$2-Tabelle1!$H44+1)","v":""},"",null,{"$f":"IF(Tabelle1!$I44=\"\",\"\",Eckdaten!$A$2-K44+1)","v":""},"",null,{"$f":"IF(L44=\"\",\"\",Eckdaten!$A$2-N44+1)","v":""},"",null,{"$f":"IF(Tabelle1!$O44=\"\",\"\",Eckdaten!$A$2-Q44+1)","v":""},"",null,{"$f":"IF(R44=\"\",\"\",Eckdaten!$A$2-T44+1)","v":""},"",{"$f":"IF(V44=\"\",\"\",V44+(W44*Eckdaten!$A$9))","v":""},null,null,{"$f":"IF(V44=\"\",\"\",Eckdaten!$A$2-Y44+1)","v":""},"",null,{"$f":"IF(Tabelle1!$Z44=\"\",\"\",Eckdaten!$A$2-Tabelle1!$AB44+1)","v":""},"",null,{"$f":"IF(Tabelle1!$AC44=\"\",\"\",Eckdaten!$A$2-AE44+1)","v":""},"",{"$f":"SUM(Tabelle1!$S44,Tabelle1!$P44,Tabelle1!$M44,Tabelle1!$J44,Tabelle1!$G44,Tabelle1!$D44,AA44,AD44,X44)","v":0},""]
["41M",null,null,{"$f":"IF(Tabelle1!$C45=\"\",\"\",Eckdaten!$A$2-Tabelle1!$E45+1)","v":""},"",null,{"$f":"IF(Tabelle1!$F45=\"\",\"\",Eckdaten!$A$2-Tabelle1!$H45+1)","v":""},"",null,{"$f":"IF(Tabelle1!$I45=\"\",\"\",Eckdaten!$A$2-K45+1)","v":""},"",null,{"$f":"IF(L45=\"\",\"\",Eckdaten!$A$2-N45+1)","v":""},"",null,{"$f":"IF(Tabelle1!$O45=\"\",\"\",Eckdaten!$A$2-Q45+1)","v":""},"",null,{"$f":"IF(R45=\"\",\"\",Eckdaten!$A$2-T45+1)","v":""},"",{"$f":"IF(V45=\"\",\"\",V45+(W45*Eckdaten!$A$9))","v":""},null,null,{"$f":"IF(V45=\"\",\"\",Eckdaten!$A$2-Y45+1)","v":""},"",null,{"$f":"IF(Tabelle1!$Z45=\"\",\"\",Eckdaten!$A$2-Tabelle1!$AB45+1)","v":""},"",null,{"$f":"IF(Tabelle1!$AC45=\"\",\"\",Eckdaten!$A$2-AE45+1)","v":""},"",{"$f":"SUM(Tabelle1!$S45,Tabelle1!$P45,Tabelle1!$M45,Tabelle1!$J45,Tabelle1!$G45,Tabelle1!$D45,AA45,AD45,X45)","v":0},""]
["42M",null,null,{"$f":"IF(Tabelle1!$C46=\"\",\"\",Eckdaten!$A$2-Tabelle1!$E46+1)","v":""},"",null,{"$f":"IF(Tabelle1!$F46=\"\",\"\",Eckdaten!$A$2-Tabelle1!$H46+1)","v":""},"",null,{"$f":"IF(Tabelle1!$I46=\"\",\"\",Eckdaten!$A$2-K46+1)","v":""},"",null,{"$f":"IF(L46=\"\",\"\",Eckdaten!$A$2-N46+1)","v":""},"",null,{"$f":"IF(Tabelle1!$O46=\"\",\"\",Eckdaten!$A$2-Q46+1)","v":""},"",null,{"$f":"IF(R46=\"\",\"\",Eckdaten!$A$2-T46+1)","v":""},"",{"$f":"IF(V46=\"\",\"\",V46+(W46*Eckdaten!$A$9))","v":""},null,null,{"$f":"IF(V46=\"\",\"\",Eckdaten!$A$2-Y46+1)","v":""},"",null,{"$f":"IF(Tabelle1!$Z46=\"\",\"\",Eckdaten!$A$2-Tabelle1!$AB46+1)","v":""},"",null,{"$f":"IF(Tabelle1!$AC46=\"\",\"\",Eckdaten!$A$2-AE46+1)","v":""},"",{"$f":"SUM(Tabelle1!$S46,Tabelle1!$P46,Tabelle1!$M46,Tabelle1!$J46,Tabelle1!$G46,Tabelle1!$D46,AA46,AD46,X46)","v":0},""]
["43M",null,null,{"$f":"IF(Tabelle1!$C47=\"\",\"\",Eckdaten!$A$2-Tabelle1!$E47+1)","v":""},"",null,{"$f":"IF(Tabelle1!$F47=\"\",\"\",Eckdaten!$A$2-Tabelle1!$H47+1)","v":""},"",null,{"$f":"IF(Tabelle1!$I47=\"\",\"\",Eckdaten!$A$2-K47+1)","v":""},"",null,{"$f":"IF(L47=\"\",\"\",Eckdaten!$A$2-N47+1)","v":""},"",null,{"$f":"IF(Tabelle1!$O47=\"\",\"\",Eckdaten!$A$2-Q47+1)","v":""},"",null,{"$f":"IF(R47=\"\",\"\",Eckdaten!$A$2-T47+1)","v":""},"",{"$f":"IF(V47=\"\",\"\",V47+(W47*Eckdaten!$A$9))","v":""},null,null,{"$f":"IF(V47=\"\",\"\",Eckdaten!$A$2-Y47+1)","v":""},"",null,{"$f":"IF(Tabelle1!$Z47=\"\",\"\",Eckdaten!$A$2-Tabelle1!$AB47+1)","v":""},"",null,{"$f":"IF(Tabelle1!$AC47=\"\",\"\",Eckdaten!$A$2-AE47+1)","v":""},"",{"$f":"SUM(Tabelle1!$S47,Tabelle1!$P47,Tabelle1!$M47,Tabelle1!$J47,Tabelle1!$G47,Tabelle1!$D47,AA47,AD47,X47)","v":0},""]
["44M",null,null,{"$f":"IF(Tabelle1!$C48=\"\",\"\",Eckdaten!$A$2-Tabelle1!$E48+1)","v":""},"",null,{"$f":"IF(Tabelle1!$F48=\"\",\"\",Eckdaten!$A$2-Tabelle1!$H48+1)","v":""},"",null,{"$f":"IF(Tabelle1!$I48=\"\",\"\",Eckdaten!$A$2-K48+1)","v":""},"",null,{"$f":"IF(L48=\"\",\"\",Eckdaten!$A$2-N48+1)","v":""},"",null,{"$f":"IF(Tabelle1!$O48=\"\",\"\",Eckdaten!$A$2-Q48+1)","v":""},"",null,{"$f":"IF(R48=\"\",\"\",Eckdaten!$A$2-T48+1)","v":""},"",{"$f":"IF(V48=\"\",\"\",V48+(W48*Eckdaten!$A$9))","v":""},null,null,{"$f":"IF(V48=\"\",\"\",Eckdaten!$A$2-Y48+1)","v":""},"",null,{"$f":"IF(Tabelle1!$Z48=\"\",\"\",Eckdaten!$A$2-Tabelle1!$AB48+1)","v":""},"",null,{"$f":"IF(Tabelle1!$AC48=\"\",\"\",Eckdaten!$A$2-AE48+1)","v":""},"",{"$f":"SUM(Tabelle1!$S48,Tabelle1!$P48,Tabelle1!$M48,Tabelle1!$J48,Tabelle1!$G48,Tabelle1!$D48,AA48,AD48,X48)","v":0},""]
["45M",null,null,{"$f":"IF(Tabelle1!$C49=\"\",\"\",Eckdaten!$A$2-Tabelle1!$E49+1)","v":""},"",null,{"$f":"IF(Tabelle1!$F49=\"\",\"\",Eckdaten!$A$2-Tabelle1!$H49+1)","v":""},"",null,{"$f":"IF(Tabelle1!$I49=\"\",\"\",Eckdaten!$A$2-K49+1)","v":""},"",null,{"$f":"IF(L49=\"\",\"\",Eckdaten!$A$2-N49+1)","v":""},"",null,{"$f":"IF(Tabelle1!$O49=\"\",\"\",Eckdaten!$A$2-Q49+1)","v":""},"",null,{"$f":"IF(R49=\"\",\"\",Eckdaten!$A$2-T49+1)","v":""},"",{"$f":"IF(V49=\"\",\"\",V49+(W49*Eckdaten!$A$9))","v":""},null,null,{"$f":"IF(V49=\"\",\"\",Eckdaten!$A$2-Y49+1)","v":""},"",null,{"$f":"IF(Tabelle1!$Z49=\"\",\"\",Eckdaten!$A$2-Tabelle1!$AB49+1)","v":""},"",null,{"$f":"IF(Tabelle1!$AC49=\"\",\"\",Eckdaten!$A$2-AE49+1)","v":""},"",{"$f":"SUM(Tabelle1!$S49,Tabelle1!$P49,Tabelle1!$M49,Tabelle1!$J49,Tabelle1!$G49,Tabelle1!$D49,AA49,AD49,X49)","v":0},""]
["46M",null,null,{"$f":"IF(Tabelle1!$C50=\"\",\"\",Eckdaten!$A$2-Tabelle1!$E50+1)","v":""},"",null,{"$f":"IF(Tabelle1!$F50=\"\",\"\",Eckdaten!$A$2-Tabelle1!$H50+1)","v":""},"",null,{"$f":"IF(Tabelle1!$I50=\"\",\"\",Eckdaten!$A$2-K50+1)","v":""},"",null,{"$f":"IF(L50=\"\",\"\",Eckdaten!$A$2-N50+1)","v":""},"",null,{"$f":"IF(Tabelle1!$O50=\"\",\"\",Eckdaten!$A$2-Q50+1)","v":""},"",null,{"$f":"IF(R50=\"\",\"\",Eckdaten!$A$2-T50+1)","v":""},"",{"$f":"IF(V50=\"\",\"\",V50+(W50*Eckdaten!$A$9))","v":""},null,null,{"$f":"IF(V50=\"\",\"\",Eckdaten!$A$2-Y50+1)","v":""},"",null,{"$f":"IF(Tabelle1!$Z50=\"\",\"\",Eckdaten!$A$2-Tabelle1!$AB50+1)","v":""},"",null,{"$f":"IF(Tabelle1!$AC50=\"\",\"\",Eckdaten!$A$2-AE50+1)","v":""},"",{"$f":"SUM(Tabelle1!$S50,Tabelle1!$P50,Tabelle1!$M50,Tabelle1!$J50,Tabelle1!$G50,Tabelle1!$D50,AA50,AD50,X50)","v":0},""]
["47M",null,null,{"$f":"IF(Tabelle1!$C51=\"\",\"\",Eckdaten!$A$2-Tabelle1!$E51+1)","v":""},"",null,{"$f":"IF(Tabelle1!$F51=\"\",\"\",Eckdaten!$A$2-Tabelle1!$H51+1)","v":""},"",null,{"$f":"IF(Tabelle1!$I51=\"\",\"\",Eckdaten!$A$2-K51+1)","v":""},"",null,{"$f":"IF(L51=\"\",\"\",Eckdaten!$A$2-N51+1)","v":""},"",null,{"$f":"IF(Tabelle1!$O51=\"\",\"\",Eckdaten!$A$2-Q51+1)","v":""},"",null,{"$f":"IF(R51=\"\",\"\",Eckdaten!$A$2-T51+1)","v":""},"",{"$f":"IF(V51=\"\",\"\",V51+(W51*Eckdaten!$A$9))","v":""},null,null,{"$f":"IF(V51=\"\",\"\",Eckdaten!$A$2-Y51+1)","v":""},"",null,{"$f":"IF(Tabelle1!$Z51=\"\",\"\",Eckdaten!$A$2-Tabelle1!$AB51+1)","v":""},"",null,{"$f":"IF(Tabelle1!$AC51=\"\",\"\",Eckdaten!$A$2-AE51+1)","v":""},"",{"$f":"SUM(Tabelle1!$S51,Tabelle1!$P51,Tabelle1!$M51,Tabelle1!$J51,Tabelle1!$G51,Tabelle1!$D51,AA51,AD51,X51)","v":0},""]
["48M",null,null,{"$f":"IF(Tabelle1!$C52=\"\",\"\",Eckdaten!$A$2-Tabelle1!$E52+1)","v":""},"",null,{"$f":"IF(Tabelle1!$F52=\"\",\"\",Eckdaten!$A$2-Tabelle1!$H52+1)","v":""},"",null,{"$f":"IF(Tabelle1!$I52=\"\",\"\",Eckdaten!$A$2-K52+1)","v":""},"",null,{"$f":"IF(L52=\"\",\"\",Eckdaten!$A$2-N52+1)","v":""},"",null,{"$f":"IF(Tabelle1!$O52=\"\",\"\",Eckdaten!$A$2-Q52+1)","v":""},"",null,{"$f":"IF(R52=\"\",\"\",Eckdaten!$A$2-T52+1)","v":""},"",{"$f":"IF(V52=\"\",\"\",V52+(W52*Eckdaten!$A$9))","v":""},null,null,{"$f":"IF(V52=\"\",\"\",Eckdaten!$A$2-Y52+1)","v":""},"",null,{"$f":"IF(Tabelle1!$Z52=\"\",\"\",Eckdaten!$A$2-Tabelle1!$AB52+1)","v":""},"",null,{"$f":"IF(Tabelle1!$AC52=\"\",\"\",Eckdaten!$A$2-AE52+1)","v":""},"",{"$f":"SUM(Tabelle1!$S52,Tabelle1!$P52,Tabelle1!$M52,Tabelle1!$J52,Tabelle1!$G52,Tabelle1!$D52,AA52,AD52,X52)","v":0},""]
["49M",null,null,{"$f":"IF(Tabelle1!$C53=\"\",\"\",Eckdaten!$A$2-Tabelle1!$E53+1)","v":""},"",null,{"$f":"IF(Tabelle1!$F53=\"\",\"\",Eckdaten!$A$2-Tabelle1!$H53+1)","v":""},"",null,{"$f":"IF(Tabelle1!$I53=\"\",\"\",Eckdaten!$A$2-K53+1)","v":""},"",null,{"$f":"IF(L53=\"\",\"\",Eckdaten!$A$2-N53+1)","v":""},"",null,{"$f":"IF(Tabelle1!$O53=\"\",\"\",Eckdaten!$A$2-Q53+1)","v":""},"",null,{"$f":"IF(R53=\"\",\"\",Eckdaten!$A$2-T53+1)","v":""},"",{"$f":"IF(V53=\"\",\"\",V53+(W53*Eckdaten!$A$9))","v":""},null,null,{"$f":"IF(V53=\"\",\"\",Eckdaten!$A$2-Y53+1)","v":""},"",null,{"$f":"IF(Tabelle1!$Z53=\"\",\"\",Eckdaten!$A$2-Tabelle1!$AB53+1)","v":""},"",null,{"$f":"IF(Tabelle1!$AC53=\"\",\"\",Eckdaten!$A$2-AE53+1)","v":""},"",{"$f":"SUM(Tabelle1!$S53,Tabelle1!$P53,Tabelle1!$M53,Tabelle1!$J53,Tabelle1!$G53,Tabelle1!$D53,AA53,AD53,X53)","v":0},""]
["50M",null,null,{"$f":"IF(Tabelle1!$C54=\"\",\"\",Eckdaten!$A$2-Tabelle1!$E54+1)","v":""},"",null,{"$f":"IF(Tabelle1!$F54=\"\",\"\",Eckdaten!$A$2-Tabelle1!$H54+1)","v":""},"",null,{"$f":"IF(Tabelle1!$I54=\"\",\"\",Eckdaten!$A$2-K54+1)","v":""},"",null,{"$f":"IF(L54=\"\",\"\",Eckdaten!$A$2-N54+1)","v":""},"",null,{"$f":"IF(Tabelle1!$O54=\"\",\"\",Eckdaten!$A$2-Q54+1)","v":""},"",null,{"$f":"IF(R54=\"\",\"\",Eckdaten!$A$2-T54+1)","v":""},"",{"$f":"IF(V54=\"\",\"\",V54+(W54*Eckdaten!$A$9))","v":""},null,null,{"$f":"IF(V54=\"\",\"\",Eckdaten!$A$2-Y54+1)","v":""},"",null,{"$f":"IF(Tabelle1!$Z54=\"\",\"\",Eckdaten!$A$2-Tabelle1!$AB54+1)","v":""},"",null,{"$f":"IF(Tabelle1!$AC54=\"\",\"\",Eckdaten!$A$2-AE54+1)","v":""},"",{"$f":"SUM(Tabelle1!$S54,Tabelle1!$P54,Tabelle1!$M54,Tabelle1!$J54,Tabelle1!$G54,Tabelle1!$D54,AA54,AD54,X54)","v":0},""]
[]
["Frauen"]
["Startnummer","Name","Hindernisslauf Zeit","Punkte HNL","Rang HNL","Farmerwalk","Punke FW","Rang FW","Reifenweitwurf","Punkte RW","Rang RW","Gummisiefelweitwurf","Punkte GW","Rang GW","Palette","Punkte PH","Rang PH","Reifenrollen","Punkte RR","Rang RR","Rechnungssummer","heißer Draht","Zeitstrafe","Punkte hD","Rang hD","Zusatz 1","Punke Z1","Rang Z1","Zusatz 2","Punkte Z2","Rang Z2","Gesamtpunkte","Rang"]
[null,null,"Zeit in sec.",null,null,"Zeit in sec",null,{"$f":"H56","v":0},"in m",null,{"$f":"K56","v":0},"in m",null,{"$f":"N56","v":0},"Zeit in sec",null,{"$f":"Q56","v":0},"Zeit in sec",null,{"$f":"T56","v":0},"gesamt","Zeit in sec.","in berührungen",null,null,"positiv",null,{"$f":"AB56","v":0},"negativ",null,{"$f":"AE56","v":0}]
["1F","Katharina Strasser",33.119999999999997,{"$f":"IF(Tabelle1!$C59=\"\",\"\",Eckdaten!$A$2-Tabelle1!$E59+1)","v":48},{"$f":"IF(C59=0,\"\",RANK(C59,$C$59:$C$108,1))","v":3},19.739999999999998,{"$f":"IF(Tabelle1!$F59=\"\",\"\",Eckdaten!$A$2-Tabelle1!$H59+1)","v":48},{"$f":"IF(F59=0,\"\",RANK(F59,$F$59:$F$108,1))","v":3},null,{"$f":"IF(Tabelle1!$I59=\"\",\"\",Eckdaten!$A$2-K59+1)","v":""},{"$f":"IF(I59=0,\"\",RANK(I59,$I$6:$I$153,))","v":""},16.899999999999999,{"$f":"IF(L59=\"\",\"\",Eckdaten!$A$2-N59+1)","v":49},{"$f":"IF(L59=0,\"\",RANK(L59,$L$59:$L$153))","v":2},40.549999999999997,{"$f":"IF(Tabelle1!$O59=\"\",\"\",Eckdaten!$A$2-Q59+1)","v":48},{"$f":"IF(O59=0,\"\",RANK(O59,$O$59:$O$153))","v":3},9.94,{"$f":"IF(R59=\"\",\"\",Eckdaten!$A$2-T59+1)","v":49},{"$f":"IF(R59=0,\"\",RANK(R59,$R$59:$R$153,1))","v":2},{"$f":"IF(V59=\"\",\"\",V59+(W59*Eckdaten!$A$9))","v":117.33},117.33,null,{"$f":"IF(V59=\"\",\"\",Eckdaten!$A$2-Y59+1)","v":48},{"$f":"IF(ISERROR(IF(U59=0,\"\",RANK(U59,$U$59:$U$153,1))),\"\",IF(U59=0,\"\",RANK(U59,$U$59:$U$153,1)))","v":3},22.24,{"$f":"IF(Tabelle1!$Z59=\"\",\"\",Eckdaten!$A$2-Tabelle1!$AB59+1)","v":49},{"$f":"IF(Z59=0,\"\",RANK(Z59,$Z$59:$Z$153,1))","v":2},null,{"$f":"IF(Tabelle1!$AC59=\"\",\"\",Eckdaten!$A$2-AE59+1)","v":""},{"$f":"IF(AC59=0,\"\",RANK(AC59,$AC$59:$AC$153))","v":""},{"$f":"SUM(Tabelle1!$S59,Tabelle1!$P59,Tabelle1!$M59,Tabelle1!$J59,Tabelle1!$G59,Tabelle1!$D59,AA59,AD59,X59)","v":339},{"$f":"IF(AF59=0,\"\",RANK(AF59,$AF$59:$AF$153))","v":3}]
["2F","Magdalena Schürz",30.5,{"$f":"IF(Tabelle1!$C60=\"\",\"\",Eckdaten!$A$2-Tabelle1!$E60+1)","v":49},{"$f":"IF(C60=0,\"\",RANK(C60,$C$59:$C$108,1))","v":2},18.38,{"$f":"IF(Tabelle1!$F60=\"\",\"\",Eckdaten!$A$2-Tabelle1!$H60+1)","v":50},{"$f":"IF(F60=0,\"\",RANK(F60,$F$59:$F$108,1))","v":1},null,{"$f":"IF(Tabelle1!$I60=\"\",\"\",Eckdaten!$A$2-K60+1)","v":""},"",15.5,{"$f":"IF(L60=\"\",\"\",Eckdaten!$A$2-N60+1)","v":48},{"$f":"IF(L60=0,\"\",RANK(L60,$L$59:$L$153))","v":3},51.87,{"$f":"IF(Tabelle1!$O60=\"\",\"\",Eckdaten!$A$2-Q60+1)","v":49},{"$f":"IF(O60=0,\"\",RANK(O60,$O$59:$O$153))","v":2},10.19,{"$f":"IF(R60=\"\",\"\",Eckdaten!$A$2-T60+1)","v":48},{"$f":"IF(R60=0,\"\",RANK(R60,$R$59:$R$153,1))","v":3},{"$f":"IF(V60=\"\",\"\",V60+(W60*Eckdaten!$A$9))","v":66.569999999999993},66.569999999999993,null,{"$f":"IF(V60=\"\",\"\",Eckdaten!$A$2-Y60+1)","v":49},{"$f":"IF(ISERROR(IF(U60=0,\"\",RANK(U60,$U$59:$U$153,1))),\"\",IF(U60=0,\"\",RANK(U60,$U$59:$U$153,1)))","v":2},18.78,{"$f":"IF(Tabelle1!$Z60=\"\",\"\",Eckdaten!$A$2-Tabelle1!$AB60+1)","v":50},{"$f":"IF(Z60=0,\"\",RANK(Z60,$Z$59:$Z$153,1))","v":1},null,{"$f":"IF(Tabelle1!$AC60=\"\",\"\",Eckdaten!$A$2-AE60+1)","v":""},{"$f":"IF(AC60=0,\"\",RANK(AC60,$AC$59:$AC$153))","v":""},{"$f":"SUM(Tabelle1!$S60,Tabelle1!$P60,Tabelle1!$M60,Tabelle1!$J60,Tabelle1!$G60,Tabelle1!$D60,AA60,AD60,X60)","v":343},{"$f":"IF(AF60=0,\"\",RANK(AF60,$AF$59:$AF$153))","v":2}]
["3F","Marina Stöttner",30.37,{"$f":"IF(Tabelle1!$C61=\"\",\"\",Eckdaten!$A$2-Tabelle1!$E61+1)","v":50},{"$f":"IF(C61=0,\"\",RANK(C61,$C$59:$C$108,1))","v":1},18.84,{"$f":"IF(Tabelle1!$F61=\"\",\"\",Eckdaten!$A$2-Tabelle1!$H61+1)","v":49},2,null,{"$f":"IF(Tabelle1!$I61=\"\",\"\",Eckdaten!$A$2-K61+1)","v":""},"",19.100000000000001,{"$f":"IF(L61=\"\",\"\",Eckdaten!$A$2-N61+1)","v":50},1,66.72,{"$f":"IF(Tabelle1!$O61=\"\",\"\",Eckdaten!$A$2-Q61+1)","v":50},1,9.1199999999999992,{"$f":"IF(R61=\"\",\"\",Eckdaten!$A$2-T61+1)","v":50},1,{"$f":"IF(V61=\"\",\"\",V61+(W61*Eckdaten!$A$9))","v":61.53},61.53,null,{"$f":"IF(V61=\"\",\"\",Eckdaten!$A$2-Y61+1)","v":50},1,30.16,{"$f":"IF(Tabelle1!$Z61=\"\",\"\",Eckdaten!$A$2-Tabelle1!$AB61+1)","v":48},3,null,{"$f":"IF(Tabelle1!$AC61=\"\",\"\",Eckdaten!$A$2-AE61+1)","v":""},"",{"$f":"SUM(Tabelle1!$S61,Tabelle1!$P61,Tabelle1!$M61,Tabelle1!$J61,Tabelle1!$G61,Tabelle1!$D61,AA61,AD61,X61)","v":347},1]
["4F",null,null,{"$f":"IF(Tabelle1!$C62=\"\",\"\",Eckdaten!$A$2-Tabelle1!$E62+1)","v":""},"",null,{"$f":"IF(Tabelle1!$F62=\"\",\"\",Eckdaten!$A$2-Tabelle1!$H62+1)","v":""},"",null,{"$f":"IF(Tabelle1!$I62=\"\",\"\",Eckdaten!$A$2-K62+1)","v":""},"",null,{"$f":"IF(L62=\"\",\"\",Eckdaten!$A$2-N62+1)","v":""},"",null,{"$f":"IF(Tabelle1!$O62=\"\",\"\",Eckdaten!$A$2-Q62+1)","v":""},"",null,{"$f":"IF(R62=\"\",\"\",Eckdaten!$A$2-T62+1)","v":""},"",{"$f":"IF(V62=\"\",\"\",V62+(W62*Eckdaten!$A$9))","v":""},null,null,{"$f":"IF(V62=\"\",\"\",Eckdaten!$A$2-Y62+1)","v":""},"",null,{"$f":"IF(Tabelle1!$Z62=\"\",\"\",Eckdaten!$A$2-Tabelle1!$AB62+1)","v":""},"",null,{"$f":"IF(Tabelle1!$AC62=\"\",\"\",Eckdaten!$A$2-AE62+1)","v":""},"",{"$f":"SUM(Tabelle1!$S62,Tabelle1!$P62,Tabelle1!$M62,Tabelle1!$J62,Tabelle1!$G62,Tabelle1!$D62,AA62,AD62,X62)","v":0},""]
["5F",null,null,{"$f":"IF(Tabelle1!$C63=\"\",\"\",Eckdaten!$A$2-Tabelle1!$E63+1)","v":""},"",null,{"$f":"IF(Tabelle1!$F63=\"\",\"\",Eckdaten!$A$2-Tabelle1!$H63+1)","v":""},"",null,{"$f":"IF(Tabelle1!$I63=\"\",\"\",Eckdaten!$A$2-K63+1)","v":""},"",null,{"$f":"IF(L63=\"\",\"\",Eckdaten!$A$2-N63+1)","v":""},"",null,{"$f":"IF(Tabelle1!$O63=\"\",\"\",Eckdaten!$A$2-Q63+1)","v":""},"",null,{"$f":"IF(R63=\"\",\"\",Eckdaten!$A$2-T63+1)","v":""},"",{"$f":"IF(V63=\"\",\"\",V63+(W63*Eckdaten!$A$9))","v":""},null,null,{"$f":"IF(V63=\"\",\"\",Eckdaten!$A$2-Y63+1)","v":""},"",null,{"$f":"IF(Tabelle1!$Z63=\"\",\"\",Eckdaten!$A$2-Tabelle1!$AB63+1)","v":""},"",null,{"$f":"IF(Tabelle1!$AC63=\"\",\"\",Eckdaten!$A$2-AE63+1)","v":""},"",{"$f":"SUM(Tabelle1!$S63,Tabelle1!$P63,Tabelle1!$M63,Tabelle1!$J63,Tabelle1!$G63,Tabelle1!$D63,AA63,AD63,X63)","v":0},""]
["6F",null,null,{"$f":"IF(Tabelle1!$C64=\"\",\"\",Eckdaten!$A$2-Tabelle1!$E64+1)","v":""},"",null,{"$f":"IF(Tabelle1!$F64=\"\",\"\",Eckdaten!$A$2-Tabelle1!$H64+1)","v":""},"",null,{"$f":"IF(Tabelle1!$I64=\"\",\"\",Eckdaten!$A$2-K64+1)","v":""},"",null,{"$f":"IF(L64=\"\",\"\",Eckdaten!$A$2-N64+1)","v":""},"",null,{"$f":"IF(Tabelle1!$O64=\"\",\"\",Eckdaten!$A$2-Q64+1)","v":""},"",null,{"$f":"IF(R64=\"\",\"\",Eckdaten!$A$2-T64+1)","v":""},"",{"$f":"IF(V64=\"\",\"\",V64+(W64*Eckdaten!$A$9))","v":""},null,null,{"$f":"IF(V64=\"\",\"\",Eckdaten!$A$2-Y64+1)","v":""},"",null,{"$f":"IF(Tabelle1!$Z64=\"\",\"\",Eckdaten!$A$2-Tabelle1!$AB64+1)","v":""},"",null,{"$f":"IF(Tabelle1!$AC64=\"\",\"\",Eckdaten!$A$2-AE64+1)","v":""},"",{"$f":"SUM(Tabelle1!$S64,Tabelle1!$P64,Tabelle1!$M64,Tabelle1!$J64,Tabelle1!$G64,Tabelle1!$D64,AA64,AD64,X64)","v":0},""]
["7F",null,null,{"$f":"IF(Tabelle1!$C65=\"\",\"\",Eckdaten!$A$2-Tabelle1!$E65+1)","v":""},"",null,{"$f":"IF(Tabelle1!$F65=\"\",\"\",Eckdaten!$A$2-Tabelle1!$H65+1)","v":""},"",null,{"$f":"IF(Tabelle1!$I65=\"\",\"\",Eckdaten!$A$2-K65+1)","v":""},"",null,{"$f":"IF(L65=\"\",\"\",Eckdaten!$A$2-N65+1)","v":""},"",null,{"$f":"IF(Tabelle1!$O65=\"\",\"\",Eckdaten!$A$2-Q65+1)","v":""},"",null,{"$f":"IF(R65=\"\",\"\",Eckdaten!$A$2-T65+1)","v":""},"",{"$f":"IF(V65=\"\",\"\",V65+(W65*Eckdaten!$A$9))","v":""},null,null,{"$f":"IF(V65=\"\",\"\",Eckdaten!$A$2-Y65+1)","v":""},"",null,{"$f":"IF(Tabelle1!$Z65=\"\",\"\",Eckdaten!$A$2-Tabelle1!$AB65+1)","v":""},"",null,{"$f":"IF(Tabelle1!$AC65=\"\",\"\",Eckdaten!$A$2-AE65+1)","v":""},"",{"$f":"SUM(Tabelle1!$S65,Tabelle1!$P65,Tabelle1!$M65,Tabelle1!$J65,Tabelle1!$G65,Tabelle1!$D65,AA65,AD65,X65)","v":0},""]
["8F",null,null,{"$f":"IF(Tabelle1!$C66=\"\",\"\",Eckdaten!$A$2-Tabelle1!$E66+1)","v":""},"",null,{"$f":"IF(Tabelle1!$F66=\"\",\"\",Eckdaten!$A$2-Tabelle1!$H66+1)","v":""},"",null,{"$f":"IF(Tabelle1!$I66=\"\",\"\",Eckdaten!$A$2-K66+1)","v":""},"",null,{"$f":"IF(L66=\"\",\"\",Eckdaten!$A$2-N66+1)","v":""},"",null,{"$f":"IF(Tabelle1!$O66=\"\",\"\",Eckdaten!$A$2-Q66+1)","v":""},"",null,{"$f":"IF(R66=\"\",\"\",Eckdaten!$A$2-T66+1)","v":""},"",{"$f":"IF(V66=\"\",\"\",V66+(W66*Eckdaten!$A$9))","v":""},null,null,{"$f":"IF(V66=\"\",\"\",Eckdaten!$A$2-Y66+1)","v":""},"",null,{"$f":"IF(Tabelle1!$Z66=\"\",\"\",Eckdaten!$A$2-Tabelle1!$AB66+1)","v":""},"",null,{"$f":"IF(Tabelle1!$AC66=\"\",\"\",Eckdaten!$A$2-AE66+1)","v":""},"",{"$f":"SUM(Tabelle1!$S66,Tabelle1!$P66,Tabelle1!$M66,Tabelle1!$J66,Tabelle1!$G66,Tabelle1!$D66,AA66,AD66,X66)","v":0},""]
["9F",null,null,{"$f":"IF(Tabelle1!$C67=\"\",\"\",Eckdaten!$A$2-Tabelle1!$E67+1)","v":""},"",null,{"$f":"IF(Tabelle1!$F67=\"\",\"\",Eckdaten!$A$2-Tabelle1!$H67+1)","v":""},"",null,{"$f":"IF(Tabelle1!$I67=\"\",\"\",Eckdaten!$A$2-K67+1)","v":""},"",null,{"$f":"IF(L67=\"\",\"\",Eckdaten!$A$2-N67+1)","v":""},"",null,{"$f":"IF(Tabelle1!$O67=\"\",\"\",Eckdaten!$A$2-Q67+1)","v":""},"",null,{"$f":"IF(R67=\"\",\"\",Eckdaten!$A$2-T67+1)","v":""},"",{"$f":"IF(V67=\"\",\"\",V67+(W67*Eckdaten!$A$9))","v":""},null,null,{"$f":"IF(V67=\"\",\"\",Eckdaten!$A$2-Y67+1)","v":""},"",null,{"$f":"IF(Tabelle1!$Z67=\"\",\"\",Eckdaten!$A$2-Tabelle1!$AB67+1)","v":""},"",null,{"$f":"IF(Tabelle1!$AC67=\"\",\"\",Eckdaten!$A$2-AE67+1)","v":""},"",{"$f":"SUM(Tabelle1!$S67,Tabelle1!$P67,Tabelle1!$M67,Tabelle1!$J67,Tabelle1!$G67,Tabelle1!$D67,AA67,AD67,X67)","v":0},""]
["10F",null,null,{"$f":"IF(Tabelle1!$C68=\"\",\"\",Eckdaten!$A$2-Tabelle1!$E68+1)","v":""},"",null,{"$f":"IF(Tabelle1!$F68=\"\",\"\",Eckdaten!$A$2-Tabelle1!$H68+1)","v":""},"",null,{"$f":"IF(Tabelle1!$I68=\"\",\"\",Eckdaten!$A$2-K68+1)","v":""},"",null,{"$f":"IF(L68=\"\",\"\",Eckdaten!$A$2-N68+1)","v":""},"",null,{"$f":"IF(Tabelle1!$O68=\"\",\"\",Eckdaten!$A$2-Q68+1)","v":""},"",null,{"$f":"IF(R68=\"\",\"\",Eckdaten!$A$2-T68+1)","v":""},"",{"$f":"IF(V68=\"\",\"\",V68+(W68*Eckdaten!$A$9))","v":""},null,null,{"$f":"IF(V68=\"\",\"\",Eckdaten!$A$2-Y68+1)","v":""},"",null,{"$f":"IF(Tabelle1!$Z68=\"\",\"\",Eckdaten!$A$2-Tabelle1!$AB68+1)","v":""},"",null,{"$f":"IF(Tabelle1!$AC68=\"\",\"\",Eckdaten!$A$2-AE68+1)","v":""},"",{"$f":"SUM(Tabelle1!$S68,Tabelle1!$P68,Tabelle1!$M68,Tabelle1!$J68,Tabelle1!$G68,Tabelle1!$D68,AA68,AD68,X68)","v":0},""]
["11F",null,null,{"$f":"IF(Tabelle1!$C69=\"\",\"\",Eckdaten!$A$2-Tabelle1!$E69+1)","v":""},"",null,{"$f":"IF(Tabelle1!$F69=\"\",\"\",Eckdaten!$A$2-Tabelle1!$H69+1)","v":""},"",null,{"$f":"IF(Tabelle1!$I69=\"\",\"\",Eckdaten!$A$2-K69+1)","v":""},"",null,{"$f":"IF(L69=\"\",\"\",Eckdaten!$A$2-N69+1)","v":""},"",null,{"$f":"IF(Tabelle1!$O69=\"\",\"\",Eckdaten!$A$2-Q69+1)","v":""},"",null,{"$f":"IF(R69=\"\",\"\",Eckdaten!$A$2-T69+1)","v":""},"",{"$f":"IF(V69=\"\",\"\",V69+(W69*Eckdaten!$A$9))","v":""},null,null,{"$f":"IF(V69=\"\",\"\",Eckdaten!$A$2-Y69+1)","v":""},"",null,{"$f":"IF(Tabelle1!$Z69=\"\",\"\",Eckdaten!$A$2-Tabelle1!$AB69+1)","v":""},"",null,{"$f":"IF(Tabelle1!$AC69=\"\",\"\",Eckdaten!$A$2-AE69+1)","v":""},"",{"$f":"SUM(Tabelle1!$S69,Tabelle1!$P69,Tabelle1!$M69,Tabelle1!$J69,Tabelle1!$G69,Tabelle1!$D69,AA69,AD69,X69)","v":0},""]
["12F",null,null,{"$f":"IF(Tabelle1!$C70=\"\",\"\",Eckdaten!$A$2-Tabelle1!$E70+1)","v":""},"",null,{"$f":"IF(Tabelle1!$F70=\"\",\"\",Eckdaten!$A$2-Tabelle1!$H70+1)","v":""},"",null,{"$f":"IF(Tabelle1!$I70=\"\",\"\",Eckdaten!$A$2-K70+1)","v":""},"",null,{"$f":"IF(L70=\"\",\"\",Eckdaten!$A$2-N70+1)","v":""},"",null,{"$f":"IF(Tabelle1!$O70=\"\",\"\",Eckdaten!$A$2-Q70+1)","v":""},"",null,{"$f":"IF(R70=\"\",\"\",Eckdaten!$A$2-T70+1)","v":""},"",{"$f":"IF(V70=\"\",\"\",V70+(W70*Eckdaten!$A$9))","v":""},null,null,{"$f":"IF(V70=\"\",\"\",Eckdaten!$A$2-Y70+1)","v":""},"",null,{"$f":"IF(Tabelle1!$Z70=\"\",\"\",Eckdaten!$A$2-Tabelle1!$AB70+1)","v":""},"",null,{"$f":"IF(Tabelle1!$AC70=\"\",\"\",Eckdaten!$A$2-AE70+1)","v":""},"",{"$f":"SUM(Tabelle1!$S70,Tabelle1!$P70,Tabelle1!$M70,Tabelle1!$J70,Tabelle1!$G70,Tabelle1!$D70,AA70,AD70,X70)","v":0},""]
["13F",null,null,{"$f":"IF(Tabelle1!$C71=\"\",\"\",Eckdaten!$A$2-Tabelle1!$E71+1)","v":""},"",null,{"$f":"IF(Tabelle1!$F71=\"\",\"\",Eckdaten!$A$2-Tabelle1!$H71+1)","v":""},"",null,{"$f":"IF(Tabelle1!$I71=\"\",\"\",Eckdaten!$A$2-K71+1)","v":""},"",null,{"$f":"IF(L71=\"\",\"\",Eckdaten!$A$2-N71+1)","v":""},"",null,{"$f":"IF(Tabelle1!$O71=\"\",\"\",Eckdaten!$A$2-Q71+1)","v":""},"",null,{"$f":"IF(R71=\"\",\"\",Eckdaten!$A$2-T71+1)","v":""},"",{"$f":"IF(V71=\"\",\"\",V71+(W71*Eckdaten!$A$9))","v":""},null,null,{"$f":"IF(V71=\"\",\"\",Eckdaten!$A$2-Y71+1)","v":""},"",null,{"$f":"IF(Tabelle1!$Z71=\"\",\"\",Eckdaten!$A$2-Tabelle1!$AB71+1)","v":""},"",null,{"$f":"IF(Tabelle1!$AC71=\"\",\"\",Eckdaten!$A$2-AE71+1)","v":""},"",{"$f":"SUM(Tabelle1!$S71,Tabelle1!$P71,Tabelle1!$M71,Tabelle1!$J71,Tabelle1!$G71,Tabelle1!$D71,AA71,AD71,X71)","v":0},""]
["14F",null,null,{"$f":"IF(Tabelle1!$C72=\"\",\"\",Eckdaten!$A$2-Tabelle1!$E72+1)","v":""},"",null,{"$f":"IF(Tabelle1!$F72=\"\",\"\",Eckdaten!$A$2-Tabelle1!$H72+1)","v":""},"",null,{"$f":"IF(Tabelle1!$I72=\"\",\"\",Eckdaten!$A$2-K72+1)","v":""},"",null,{"$f":"IF(L72=\"\",\"\",Eckdaten!$A$2-N72+1)","v":""},"",null,{"$f":"IF(Tabelle1!$O72=\"\",\"\",Eckdaten!$A$2-Q72+1)","v":""},"",null,{"$f":"IF(R72=\"\",\"\",Eckdaten!$A$2-T72+1)","v":""},"",{"$f":"IF(V72=\"\",\"\",V72+(W72*Eckdaten!$A$9))","v":""},null,null,{"$f":"IF(V72=\"\",\"\",Eckdaten!$A$2-Y72+1)","v":""},"",null,{"$f":"IF(Tabelle1!$Z72=\"\",\"\",Eckdaten!$A$2-Tabelle1!$AB72+1)","v":""},"",null,{"$f":"IF(Tabelle1!$AC72=\"\",\"\",Eckdaten!$A$2-AE72+1)","v":""},"",{"$f":"SUM(Tabelle1!$S72,Tabelle1!$P72,Tabelle1!$M72,Tabelle1!$J72,Tabelle1!$G72,Tabelle1!$D72,AA72,AD72,X72)","v":0},""]
["15F",null,null,{"$f":"IF(Tabelle1!$C73=\"\",\"\",Eckdaten!$A$2-Tabelle1!$E73+1)","v":""},"",null,{"$f":"IF(Tabelle1!$F73=\"\",\"\",Eckdaten!$A$2-Tabelle1!$H73+1)","v":""},"",null,{"$f":"IF(Tabelle1!$I73=\"\",\"\",Eckdaten!$A$2-K73+1)","v":""},"",null,{"$f":"IF(L73=\"\",\"\",Eckdaten!$A$2-N73+1)","v":""},"",null,{"$f":"IF(Tabelle1!$O73=\"\",\"\",Eckdaten!$A$2-Q73+1)","v":""},"",null,{"$f":"IF(R73=\"\",\"\",Eckdaten!$A$2-T73+1)","v":""},"",{"$f":"IF(V73=\"\",\"\",V73+(W73*Eckdaten!$A$9))","v":""},null,null,{"$f":"IF(V73=\"\",\"\",Eckdaten!$A$2-Y73+1)","v":""},"",null,{"$f":"IF(Tabelle1!$Z73=\"\",\"\",Eckdaten!$A$2-Tabelle1!$AB73+1)","v":""},"",null,{"$f":"IF(Tabelle1!$AC73=\"\",\"\",Eckdaten!$A$2-AE73+1)","v":""},"",{"$f":"SUM(Tabelle1!$S73,Tabelle1!$P73,Tabelle1!$M73,Tabelle1!$J73,Tabelle1!$G73,Tabelle1!$D73,AA73,AD73,X73)","v":0},""]
["16F",null,null,{"$f":"IF(Tabelle1!$C74=\"\",\"\",Eckdaten!$A$2-Tabelle1!$E74+1)","v":""},"",null,{"$f":"IF(Tabelle1!$F74=\"\",\"\",Eckdaten!$A$2-Tabelle1!$H74+1)","v":""},"",null,{"$f":"IF(Tabelle1!$I74=\"\",\"\",Eckdaten!$A$2-K74+1)","v":""},"",null,{"$f":"IF(L74=\"\",\"\",Eckdaten!$A$2-N74+1)","v":""},"",null,{"$f":"IF(Tabelle1!$O74=\"\",\"\",Eckdaten!$A$2-Q74+1)","v":""},"",null,{"$f":"IF(R74=\"\",\"\",Eckdaten!$A$2-T74+1)","v":""},"",{"$f":"IF(V74=\"\",\"\",V74+(W74*Eckdaten!$A$9))","v":""},null,null,{"$f":"IF(V74=\"\",\"\",Eckdaten!$A$2-Y74+1)","v":""},"",null,{"$f":"IF(Tabelle1!$Z74=\"\",\"\",Eckdaten!$A$2-Tabelle1!$AB74+1)","v":""},"",null,{"$f":"IF(Tabelle1!$AC74=\"\",\"\",Eckdaten!$A$2-AE74+1)","v":""},"",{"$f":"SUM(Tabelle1!$S74,Tabelle1!$P74,Tabelle1!$M74,Tabelle1!$J74,Tabelle1!$G74,Tabelle1!$D74,AA74,AD74,X74)","v":0},""]
["17F",null,null,{"$f":"IF(Tabelle1!$C75=\"\",\"\",Eckdaten!$A$2-Tabelle1!$E75+1)","v":""},"",null,{"$f":"IF(Tabelle1!$F75=\"\",\"\",Eckdaten!$A$2-Tabelle1!$H75+1)","v":""},"",null,{"$f":"IF(Tabelle1!$I75=\"\",\"\",Eckdaten!$A$2-K75+1)","v":""},"",null,{"$f":"IF(L75=\"\",\"\",Eckdaten!$A$2-N75+1)","v":""},"",null,{"$f":"IF(Tabelle1!$O75=\"\",\"\",Eckdaten!$A$2-Q75+1)","v":""},"",null,{"$f":"IF(R75=\"\",\"\",Eckdaten!$A$2-T75+1)","v":""},"",{"$f":"IF(V75=\"\",\"\",V75+(W75*Eckdaten!$A$9))","v":""},null,null,{"$f":"IF(V75=\"\",\"\",Eckdaten!$A$2-Y75+1)","v":""},"",null,{"$f":"IF(Tabelle1!$Z75=\"\",\"\",Eckdaten!$A$2-Tabelle1!$AB75+1)","v":""},"",null,{"$f":"IF(Tabelle1!$AC75=\"\",\"\",Eckdaten!$A$2-AE75+1)","v":""},"",{"$f":"SUM(Tabelle1!$S75,Tabelle1!$P75,Tabelle1!$M75,Tabelle1!$J75,Tabelle1!$G75,Tabelle1!$D75,AA75,AD75,X75)","v":0},""]
["18F",null,null,{"$f":"IF(Tabelle1!$C76=\"\",\"\",Eckdaten!$A$2-Tabelle1!$E76+1)","v":""},"",null,{"$f":"IF(Tabelle1!$F76=\"\",\"\",Eckdaten!$A$2-Tabelle1!$H76+1)","v":""},"",null,{"$f":"IF(Tabelle1!$I76=\"\",\"\",Eckdaten!$A$2-K76+1)","v":""},"",null,{"$f":"IF(L76=\"\",\"\",Eckdaten!$A$2-N76+1)","v":""},"",null,{"$f":"IF(Tabelle1!$O76=\"\",\"\",Eckdaten!$A$2-Q76+1)","v":""},"",null,{"$f":"IF(R76=\"\",\"\",Eckdaten!$A$2-T76+1)","v":""},"",{"$f":"IF(V76=\"\",\"\",V76+(W76*Eckdaten!$A$9))","v":""},null,null,{"$f":"IF(V76=\"\",\"\",Eckdaten!$A$2-Y76+1)","v":""},"",null,{"$f":"IF(Tabelle1!$Z76=\"\",\"\",Eckdaten!$A$2-Tabelle1!$AB76+1)","v":""},"",null,{"$f":"IF(Tabelle1!$AC76=\"\",\"\",Eckdaten!$A$2-AE76+1)","v":""},"",{"$f":"SUM(Tabelle1!$S76,Tabelle1!$P76,Tabelle1!$M76,Tabelle1!$J76,Tabelle1!$G76,Tabelle1!$D76,AA76,AD76,X76)","v":0},""]
["19F",null,null,{"$f":"IF(Tabelle1!$C77=\"\",\"\",Eckdaten!$A$2-Tabelle1!$E77+1)","v":""},"",null,{"$f":"IF(Tabelle1!$F77=\"\",\"\",Eckdaten!$A$2-Tabelle1!$H77+1)","v":""},"",null,{"$f":"IF(Tabelle1!$I77=\"\",\"\",Eckdaten!$A$2-K77+1)","v":""},"",null,{"$f":"IF(L77=\"\",\"\",Eckdaten!$A$2-N77+1)","v":""},"",null,{"$f":"IF(Tabelle1!$O77=\"\",\"\",Eckdaten!$A$2-Q77+1)","v":""},"",null,{"$f":"IF(R77=\"\",\"\",Eckdaten!$A$2-T77+1)","v":""},"",{"$f":"IF(V77=\"\",\"\",V77+(W77*Eckdaten!$A$9))","v":""},null,null,{"$f":"IF(V77=\"\",\"\",Eckdaten!$A$2-Y77+1)","v":""},"",null,{"$f":"IF(Tabelle1!$Z77=\"\",\"\",Eckdaten!$A$2-Tabelle1!$AB77+1)","v":""},"",null,{"$f":"IF(Tabelle1!$AC77=\"\",\"\",Eckdaten!$A$2-AE77+1)","v":""},"",{"$f":"SUM(Tabelle1!$S77,Tabelle1!$P77,Tabelle1!$M77,Tabelle1!$J77,Tabelle1!$G77,Tabelle1!$D77,AA77,AD77,X77)","v":0},""]
["20F",null,null,{"$f":"IF(Tabelle1!$C78=\"\",\"\",Eckdaten!$A$2-Tabelle1!$E78+1)","v":""},"",null,{"$f":"IF(Tabelle1!$F78=\"\",\"\",Eckdaten!$A$2-Tabelle1!$H78+1)","v":""},"",null,{"$f":"IF(Tabelle1!$I78=\"\",\"\",Eckdaten!$A$2-K78+1)","v":""},"",null,{"$f":"IF(L78=\"\",\"\",Eckdaten!$A$2-N78+1)","v":""},"",null,{"$f":"IF(Tabelle1!$O78=\"\",\"\",Eckdaten!$A$2-Q78+1)","v":""},"",null,{"$f":"IF(R78=\"\",\"\",Eckdaten!$A$2-T78+1)","v":""},"",{"$f":"IF(V78=\"\",\"\",V78+(W78*Eckdaten!$A$9))","v":""},null,null,{"$f":"IF(V78=\"\",\"\",Eckdaten!$A$2-Y78+1)","v":""},"",null,{"$f":"IF(Tabelle1!$Z78=\"\",\"\",Eckdaten!$A$2-Tabelle1!$AB78+1)","v":""},"",null,{"$f":"IF(Tabelle1!$AC78=\"\",\"\",Eckdaten!$A$2-AE78+1)","v":""},"",{"$f":"SUM(Tabelle1!$S78,Tabelle1!$P78,Tabelle1!$M78,Tabelle1!$J78,Tabelle1!$G78,Tabelle1!$D78,AA78,AD78,X78)","v":0},""]
["21F",null,null,{"$f":"IF(Tabelle1!$C79=\"\",\"\",Eckdaten!$A$2-Tabelle1!$E79+1)","v":""},"",null,{"$f":"IF(Tabelle1!$F79=\"\",\"\",Eckdaten!$A$2-Tabelle1!$H79+1)","v":""},"",null,{"$f":"IF(Tabelle1!$I79=\"\",\"\",Eckdaten!$A$2-K79+1)","v":""},"",null,{"$f":"IF(L79=\"\",\"\",Eckdaten!$A$2-N79+1)","v":""},"",null,{"$f":"IF(Tabelle1!$O79=\"\",\"\",Eckdaten!$A$2-Q79+1)","v":""},"",null,{"$f":"IF(R79=\"\",\"\",Eckdaten!$A$2-T79+1)","v":""},"",{"$f":"IF(V79=\"\",\"\",V79+(W79*Eckdaten!$A$9))","v":""},null,null,{"$f":"IF(V79=\"\",\"\",Eckdaten!$A$2-Y79+1)","v":""},"",null,{"$f":"IF(Tabelle1!$Z79=\"\",\"\",Eckdaten!$A$2-Tabelle1!$AB79+1)","v":""},"",null,{"$f":"IF(Tabelle1!$AC79=\"\",\"\",Eckdaten!$A$2-AE79+1)","v":""},"",{"$f":"SUM(Tabelle1!$S79,Tabelle1!$P79,Tabelle1!$M79,Tabelle1!$J79,Tabelle1!$G79,Tabelle1!$D79,AA79,AD79,X79)","v":0},""]
["22F",null,null,{"$f":"IF(Tabelle1!$C80=\"\",\"\",Eckdaten!$A$2-Tabelle1!$E80+1)","v":""},"",null,{"$f":"IF(Tabelle1!$F80=\"\",\"\",Eckdaten!$A$2-Tabelle1!$H80+1)","v":""},"",null,{"$f":"IF(Tabelle1!$I80=\"\",\"\",Eckdaten!$A$2-K80+1)","v":""},"",null,{"$f":"IF(L80=\"\",\"\",Eckdaten!$A$2-N80+1)","v":""},"",null,{"$f":"IF(Tabelle1!$O80=\"\",\"\",Eckdaten!$A$2-Q80+1)","v":""},"",null,{"$f":"IF(R80=\"\",\"\",Eckdaten!$A$2-T80+1)","v":""},"",{"$f":"IF(V80=\"\",\"\",V80+(W80*Eckdaten!$A$9))","v":""},null,null,{"$f":"IF(V80=\"\",\"\",Eckdaten!$A$2-Y80+1)","v":""},"",null,{"$f":"IF(Tabelle1!$Z80=\"\",\"\",Eckdaten!$A$2-Tabelle1!$AB80+1)","v":""},"",null,{"$f":"IF(Tabelle1!$AC80=\"\",\"\",Eckdaten!$A$2-AE80+1)","v":""},"",{"$f":"SUM(Tabelle1!$S80,Tabelle1!$P80,Tabelle1!$M80,Tabelle1!$J80,Tabelle1!$G80,Tabelle1!$D80,AA80,AD80,X80)","v":0},""]
["23F",null,null,{"$f":"IF(Tabelle1!$C81=\"\",\"\",Eckdaten!$A$2-Tabelle1!$E81+1)","v":""},"",null,{"$f":"IF(Tabelle1!$F81=\"\",\"\",Eckdaten!$A$2-Tabelle1!$H81+1)","v":""},"",null,{"$f":"IF(Tabelle1!$I81=\"\",\"\",Eckdaten!$A$2-K81+1)","v":""},"",null,{"$f":"IF(L81=\"\",\"\",Eckdaten!$A$2-N81+1)","v":""},"",null,{"$f":"IF(Tabelle1!$O81=\"\",\"\",Eckdaten!$A$2-Q81+1)","v":""},"",null,{"$f":"IF(R81=\"\",\"\",Eckdaten!$A$2-T81+1)","v":""},"",{"$f":"IF(V81=\"\",\"\",V81+(W81*Eckdaten!$A$9))","v":""},null,null,{"$f":"IF(V81=\"\",\"\",Eckdaten!$A$2-Y81+1)","v":""},"",null,{"$f":"IF(Tabelle1!$Z81=\"\",\"\",Eckdaten!$A$2-Tabelle1!$AB81+1)","v":""},"",null,{"$f":"IF(Tabelle1!$AC81=\"\",\"\",Eckdaten!$A$2-AE81+1)","v":""},"",{"$f":"SUM(Tabelle1!$S81,Tabelle1!$P81,Tabelle1!$M81,Tabelle1!$J81,Tabelle1!$G81,Tabelle1!$D81,AA81,AD81,X81)","v":0},""]
["24F",null,null,{"$f":"IF(Tabelle1!$C82=\"\",\"\",Eckdaten!$A$2-Tabelle1!$E82+1)","v":""},"",null,{"$f":"IF(Tabelle1!$F82=\"\",\"\",Eckdaten!$A$2-Tabelle1!$H82+1)","v":""},"",null,{"$f":"IF(Tabelle1!$I82=\"\",\"\",Eckdaten!$A$2-K82+1)","v":""},"",null,{"$f":"IF(L82=\"\",\"\",Eckdaten!$A$2-N82+1)","v":""},"",null,{"$f":"IF(Tabelle1!$O82=\"\",\"\",Eckdaten!$A$2-Q82+1)","v":""},"",null,{"$f":"IF(R82=\"\",\"\",Eckdaten!$A$2-T82+1)","v":""},"",{"$f":"IF(V82=\"\",\"\",V82+(W82*Eckdaten!$A$9))","v":""},null,null,{"$f":"IF(V82=\"\",\"\",Eckdaten!$A$2-Y82+1)","v":""},"",null,{"$f":"IF(Tabelle1!$Z82=\"\",\"\",Eckdaten!$A$2-Tabelle1!$AB82+1)","v":""},"",null,{"$f":"IF(Tabelle1!$AC82=\"\",\"\",Eckdaten!$A$2-AE82+1)","v":""},"",{"$f":"SUM(Tabelle1!$S82,Tabelle1!$P82,Tabelle1!$M82,Tabelle1!$J82,Tabelle1!$G82,Tabelle1!$D82,AA82,AD82,X82)","v":0},""]
["25F",null,null,{"$f":"IF(Tabelle1!$C83=\"\",\"\",Eckdaten!$A$2-Tabelle1!$E83+1)","v":""},"",null,{"$f":"IF(Tabelle1!$F83=\"\",\"\",Eckdaten!$A$2-Tabelle1!$H83+1)","v":""},"",null,{"$f":"IF(Tabelle1!$I83=\"\",\"\",Eckdaten!$A$2-K83+1)","v":""},"",null,{"$f":"IF(L83=\"\",\"\",Eckdaten!$A$2-N83+1)","v":""},"",null,{"$f":"IF(Tabelle1!$O83=\"\",\"\",Eckdaten!$A$2-Q83+1)","v":""},"",null,{"$f":"IF(R83=\"\",\"\",Eckdaten!$A$2-T83+1)","v":""},"",{"$f":"IF(V83=\"\",\"\",V83+(W83*Eckdaten!$A$9))","v":""},null,null,{"$f":"IF(V83=\"\",\"\",Eckdaten!$A$2-Y83+1)","v":""},"",null,{"$f":"IF(Tabelle1!$Z83=\"\",\"\",Eckdaten!$A$2-Tabelle1!$AB83+1)","v":""},"",null,{"$f":"IF(Tabelle1!$AC83=\"\",\"\",Eckdaten!$A$2-AE83+1)","v":""},"",{"$f":"SUM(Tabelle1!$S83,Tabelle1!$P83,Tabelle1!$M83,Tabelle1!$J83,Tabelle1!$G83,Tabelle1!$D83,AA83,AD83,X83)","v":0},""]
["26F",null,null,{"$f":"IF(Tabelle1!$C84=\"\",\"\",Eckdaten!$A$2-Tabelle1!$E84+1)","v":""},"",null,{"$f":"IF(Tabelle1!$F84=\"\",\"\",Eckdaten!$A$2-Tabelle1!$H84+1)","v":""},"",null,{"$f":"IF(Tabelle1!$I84=\"\",\"\",Eckdaten!$A$2-K84+1)","v":""},"",null,{"$f":"IF(L84=\"\",\"\",Eckdaten!$A$2-N84+1)","v":""},"",null,{"$f":"IF(Tabelle1!$O84=\"\",\"\",Eckdaten!$A$2-Q84+1)","v":""},"",null,{"$f":"IF(R84=\"\",\"\",Eckdaten!$A$2-T84+1)","v":""},"",{"$f":"IF(V84=\"\",\"\",V84+(W84*Eckdaten!$A$9))","v":""},null,null,{"$f":"IF(V84=\"\",\"\",Eckdaten!$A$2-Y84+1)","v":""},"",null,{"$f":"IF(Tabelle1!$Z84=\"\",\"\",Eckdaten!$A$2-Tabelle1!$AB84+1)","v":""},"",null,{"$f":"IF(Tabelle1!$AC84=\"\",\"\",Eckdaten!$A$2-AE84+1)","v":""},"",{"$f":"SUM(Tabelle1!$S84,Tabelle1!$P84,Tabelle1!$M84,Tabelle1!$J84,Tabelle1!$G84,Tabelle1!$D84,AA84,AD84,X84)","v":0},""]
["27F",null,null,{"$f":"IF(Tabelle1!$C85=\"\",\"\",Eckdaten!$A$2-Tabelle1!$E85+1)","v":""},"",null,{"$f":"IF(Tabelle1!$F85=\"\",\"\",Eckdaten!$A$2-Tabelle1!$H85+1)","v":""},"",null,{"$f":"IF(Tabelle1!$I85=\"\",\"\",Eckdaten!$A$2-K85+1)","v":""},"",null,{"$f":"IF(L85=\"\",\"\",Eckdaten!$A$2-N85+1)","v":""},"",null,{"$f":"IF(Tabelle1!$O85=\"\",\"\",Eckdaten!$A$2-Q85+1)","v":""},"",null,{"$f":"IF(R85=\"\",\"\",Eckdaten!$A$2-T85+1)","v":""},"",{"$f":"IF(V85=\"\",\"\",V85+(W85*Eckdaten!$A$9))","v":""},null,null,{"$f":"IF(V85=\"\",\"\",Eckdaten!$A$2-Y85+1)","v":""},"",null,{"$f":"IF(Tabelle1!$Z85=\"\",\"\",Eckdaten!$A$2-Tabelle1!$AB85+1)","v":""},"",null,{"$f":"IF(Tabelle1!$AC85=\"\",\"\",Eckdaten!$A$2-AE85+1)","v":""},"",{"$f":"SUM(Tabelle1!$S85,Tabelle1!$P85,Tabelle1!$M85,Tabelle1!$J85,Tabelle1!$G85,Tabelle1!$D85,AA85,AD85,X85)","v":0},""]
["28F",null,null,{"$f":"IF(Tabelle1!$C86=\"\",\"\",Eckdaten!$A$2-Tabelle1!$E86+1)","v":""},"",null,{"$f":"IF(Tabelle1!$F86=\"\",\"\",Eckdaten!$A$2-Tabelle1!$H86+1)","v":""},"",null,{"$f":"IF(Tabelle1!$I86=\"\",\"\",Eckdaten!$A$2-K86+1)","v":""},"",null,{"$f":"IF(L86=\"\",\"\",Eckdaten!$A$2-N86+1)","v":""},"",null,{"$f":"IF(Tabelle1!$O86=\"\",\"\",Eckdaten!$A$2-Q86+1)","v":""},"",null,{"$f":"IF(R86=\"\",\"\",Eckdaten!$A$2-T86+1)","v":""},"",{"$f":"IF(V86=\"\",\"\",V86+(W86*Eckdaten!$A$9))","v":""},null,null,{"$f":"IF(V86=\"\",\"\",Eckdaten!$A$2-Y86+1)","v":""},"",null,{"$f":"IF(Tabelle1!$Z86=\"\",\"\",Eckdaten!$A$2-Tabelle1!$AB86+1)","v":""},"",null,{"$f":"IF(Tabelle1!$AC86=\"\",\"\",Eckdaten!$A$2-AE86+1)","v":""},"",{"$f":"SUM(Tabelle1!$S86,Tabelle1!$P86,Tabelle1!$M86,Tabelle1!$J86,Tabelle1!$G86,Tabelle1!$D86,AA86,AD86,X86)","v":0},""]
["29F",null,null,{"$f":"IF(Tabelle1!$C87=\"\",\"\",Eckdaten!$A$2-Tabelle1!$E87+1)","v":""},"",null,{"$f":"IF(Tabelle1!$F87=\"\",\"\",Eckdaten!$A$2-Tabelle1!$H87+1)","v":""},"",null,{"$f":"IF(Tabelle1!$I87=\"\",\"\",Eckdaten!$A$2-K87+1)","v":""},"",null,{"$f":"IF(L87=\"\",\"\",Eckdaten!$A$2-N87+1)","v":""},"",null,{"$f":"IF(Tabelle1!$O87=\"\",\"\",Eckdaten!$A$2-Q87+1)","v":""},"",null,{"$f":"IF(R87=\"\",\"\",Eckdaten!$A$2-T87+1)","v":""},"",{"$f":"IF(V87=\"\",\"\",V87+(W87*Eckdaten!$A$9))","v":""},null,null,{"$f":"IF(V87=\"\",\"\",Eckdaten!$A$2-Y87+1)","v":""},"",null,{"$f":"IF(Tabelle1!$Z87=\"\",\"\",Eckdaten!$A$2-Tabelle1!$AB87+1)","v":""},"",null,{"$f":"IF(Tabelle1!$AC87=\"\",\"\",Eckdaten!$A$2-AE87+1)","v":""},"",{"$f":"SUM(Tabelle1!$S87,Tabelle1!$P87,Tabelle1!$M87,Tabelle1!$J87,Tabelle1!$G87,Tabelle1!$D87,AA87,AD87,X87)","v":0},""]
["30F",null,null,{"$f":"IF(Tabelle1!$C88=\"\",\"\",Eckdaten!$A$2-Tabelle1!$E88+1)","v":""},"",null,{"$f":"IF(Tabelle1!$F88=\"\",\"\",Eckdaten!$A$2-Tabelle1!$H88+1)","v":""},"",null,{"$f":"IF(Tabelle1!$I88=\"\",\"\",Eckdaten!$A$2-K88+1)","v":""},"",null,{"$f":"IF(L88=\"\",\"\",Eckdaten!$A$2-N88+1)","v":""},"",null,{"$f":"IF(Tabelle1!$O88=\"\",\"\",Eckdaten!$A$2-Q88+1)","v":""},"",null,{"$f":"IF(R88=\"\",\"\",Eckdaten!$A$2-T88+1)","v":""},"",{"$f":"IF(V88=\"\",\"\",V88+(W88*Eckdaten!$A$9))","v":""},null,null,{"$f":"IF(V88=\"\",\"\",Eckdaten!$A$2-Y88+1)","v":""},"",null,{"$f":"IF(Tabelle1!$Z88=\"\",\"\",Eckdaten!$A$2-Tabelle1!$AB88+1)","v":""},"",null,{"$f":"IF(Tabelle1!$AC88=\"\",\"\",Eckdaten!$A$2-AE88+1)","v":""},"",{"$f":"SUM(Tabelle1!$S88,Tabelle1!$P88,Tabelle1!$M88,Tabelle1!$J88,Tabelle1!$G88,Tabelle1!$D88,AA88,AD88,X88)","v":0},""]
["31F",null,null,{"$f":"IF(Tabelle1!$C89=\"\",\"\",Eckdaten!$A$2-Tabelle1!$E89+1)","v":""},"",null,{"$f":"IF(Tabelle1!$F89=\"\",\"\",Eckdaten!$A$2-Tabelle1!$H89+1)","v":""},"",null,{"$f":"IF(Tabelle1!$I89=\"\",\"\",Eckdaten!$A$2-K89+1)","v":""},"",null,{"$f":"IF(L89=\"\",\"\",Eckdaten!$A$2-N89+1)","v":""},"",null,{"$f":"IF(Tabelle1!$O89=\"\",\"\",Eckdaten!$A$2-Q89+1)","v":""},"",null,{"$f":"IF(R89=\"\",\"\",Eckdaten!$A$2-T89+1)","v":""},"",{"$f":"IF(V89=\"\",\"\",V89+(W89*Eckdaten!$A$9))","v":""},null,null,{"$f":"IF(V89=\"\",\"\",Eckdaten!$A$2-Y89+1)","v":""},"",null,{"$f":"IF(Tabelle1!$Z89=\"\",\"\",Eckdaten!$A$2-Tabelle1!$AB89+1)","v":""},"",null,{"$f":"IF(Tabelle1!$AC89=\"\",\"\",Eckdaten!$A$2-AE89+1)","v":""},"",{"$f":"SUM(Tabelle1!$S89,Tabelle1!$P89,Tabelle1!$M89,Tabelle1!$J89,Tabelle1!$G89,Tabelle1!$D89,AA89,AD89,X89)","v":0},""]
["32F",null,null,{"$f":"IF(Tabelle1!$C90=\"\",\"\",Eckdaten!$A$2-Tabelle1!$E90+1)","v":""},"",null,{"$f":"IF(Tabelle1!$F90=\"\",\"\",Eckdaten!$A$2-Tabelle1!$H90+1)","v":""},"",null,{"$f":"IF(Tabelle1!$I90=\"\",\"\",Eckdaten!$A$2-K90+1)","v":""},"",null,{"$f":"IF(L90=\"\",\"\",Eckdaten!$A$2-N90+1)","v":""},"",null,{"$f":"IF(Tabelle1!$O90=\"\",\"\",Eckdaten!$A$2-Q90+1)","v":""},"",null,{"$f":"IF(R90=\"\",\"\",Eckdaten!$A$2-T90+1)","v":""},"",{"$f":"IF(V90=\"\",\"\",V90+(W90*Eckdaten!$A$9))","v":""},null,null,{"$f":"IF(V90=\"\",\"\",Eckdaten!$A$2-Y90+1)","v":""},"",null,{"$f":"IF(Tabelle1!$Z90=\"\",\"\",Eckdaten!$A$2-Tabelle1!$AB90+1)","v":""},"",null,{"$f":"IF(Tabelle1!$AC90=\"\",\"\",Eckdaten!$A$2-AE90+1)","v":""},"",{"$f":"SUM(Tabelle1!$S90,Tabelle1!$P90,Tabelle1!$M90,Tabelle1!$J90,Tabelle1!$G90,Tabelle1!$D90,AA90,AD90,X90)","v":0},""]
["33F",null,null,{"$f":"IF(Tabelle1!$C91=\"\",\"\",Eckdaten!$A$2-Tabelle1!$E91+1)","v":""},"",null,{"$f":"IF(Tabelle1!$F91=\"\",\"\",Eckdaten!$A$2-Tabelle1!$H91+1)","v":""},"",null,{"$f":"IF(Tabelle1!$I91=\"\",\"\",Eckdaten!$A$2-K91+1)","v":""},{"$f":"IF(I91=0,\"\",RANK(I91,$I$6:$I$153,))","v":""},null,{"$f":"IF(L91=\"\",\"\",Eckdaten!$A$2-N91+1)","v":""},"",null,{"$f":"IF(Tabelle1!$O91=\"\",\"\",Eckdaten!$A$2-Q91+1)","v":""},"",null,{"$f":"IF(R91=\"\",\"\",Eckdaten!$A$2-T91+1)","v":""},"",{"$f":"IF(V91=\"\",\"\",V91+(W91*Eckdaten!$A$9))","v":""},null,null,{"$f":"IF(V91=\"\",\"\",Eckdaten!$A$2-Y91+1)","v":""},"",null,{"$f":"IF(Tabelle1!$Z91=\"\",\"\",Eckdaten!$A$2-Tabelle1!$AB91+1)","v":""},"",null,{"$f":"IF(Tabelle1!$AC91=\"\",\"\",Eckdaten!$A$2-AE91+1)","v":""},"",{"$f":"SUM(Tabelle1!$S91,Tabelle1!$P91,Tabelle1!$M91,Tabelle1!$J91,Tabelle1!$G91,Tabelle1!$D91,AA91,AD91,X91)","v":0},""]
["34F",null,null,{"$f":"IF(Tabelle1!$C92=\"\",\"\",Eckdaten!$A$2-Tabelle1!$E92+1)","v":""},"",null,{"$f":"IF(Tabelle1!$F92=\"\",\"\",Eckdaten!$A$2-Tabelle1!$H92+1)","v":""},"",null,{"$f":"IF(Tabelle1!$I92=\"\",\"\",Eckdaten!$A$2-K92+1)","v":""},"",null,{"$f":"IF(L92=\"\",\"\",Eckdaten!$A$2-N92+1)","v":""},"",null,{"$f":"IF(Tabelle1!$O92=\"\",\"\",Eckdaten!$A$2-Q92+1)","v":""},"",null,{"$f":"IF(R92=\"\",\"\",Eckdaten!$A$2-T92+1)","v":""},"",{"$f":"IF(V92=\"\",\"\",V92+(W92*Eckdaten!$A$9))","v":""},null,null,{"$f":"IF(V92=\"\",\"\",Eckdaten!$A$2-Y92+1)","v":""},"",null,{"$f":"IF(Tabelle1!$Z92=\"\",\"\",Eckdaten!$A$2-Tabelle1!$AB92+1)","v":""},"",null,{"$f":"IF(Tabelle1!$AC92=\"\",\"\",Eckdaten!$A$2-AE92+1)","v":""},"",{"$f":"SUM(Tabelle1!$S92,Tabelle1!$P92,Tabelle1!$M92,Tabelle1!$J92,Tabelle1!$G92,Tabelle1!$D92,AA92,AD92,X92)","v":0},""]
["35F",null,null,{"$f":"IF(Tabelle1!$C93=\"\",\"\",Eckdaten!$A$2-Tabelle1!$E93+1)","v":""},"",null,{"$f":"IF(Tabelle1!$F93=\"\",\"\",Eckdaten!$A$2-Tabelle1!$H93+1)","v":""},"",null,{"$f":"IF(Tabelle1!$I93=\"\",\"\",Eckdaten!$A$2-K93+1)","v":""},"",null,{"$f":"IF(L93=\"\",\"\",Eckdaten!$A$2-N93+1)","v":""},"",null,{"$f":"IF(Tabelle1!$O93=\"\",\"\",Eckdaten!$A$2-Q93+1)","v":""},"",null,{"$f":"IF(R93=\"\",\"\",Eckdaten!$A$2-T93+1)","v":""},"",{"$f":"IF(V93=\"\",\"\",V93+(W93*Eckdaten!$A$9))","v":""},null,null,{"$f":"IF(V93=\"\",\"\",Eckdaten!$A$2-Y93+1)","v":""},"",null,{"$f":"IF(Tabelle1!$Z93=\"\",\"\",Eckdaten!$A$2-Tabelle1!$AB93+1)","v":""},"",null,{"$f":"IF(Tabelle1!$AC93=\"\",\"\",Eckdaten!$A$2-AE93+1)","v":""},"",{"$f":"SUM(Tabelle1!$S93,Tabelle1!$P93,Tabelle1!$M93,Tabelle1!$J93,Tabelle1!$G93,Tabelle1!$D93,AA93,AD93,X93)","v":0},""]
["36F",null,null,{"$f":"IF(Tabelle1!$C94=\"\",\"\",Eckdaten!$A$2-Tabelle1!$E94+1)","v":""},"",null,{"$f":"IF(Tabelle1!$F94=\"\",\"\",Eckdaten!$A$2-Tabelle1!$H94+1)","v":""},"",null,{"$f":"IF(Tabelle1!$I94=\"\",\"\",Eckdaten!$A$2-K94+1)","v":""},"",null,{"$f":"IF(L94=\"\",\"\",Eckdaten!$A$2-N94+1)","v":""},"",null,{"$f":"IF(Tabelle1!$O94=\"\",\"\",Eckdaten!$A$2-Q94+1)","v":""},"",null,{"$f":"IF(R94=\"\",\"\",Eckdaten!$A$2-T94+1)","v":""},"",{"$f":"IF(V94=\"\",\"\",V94+(W94*Eckdaten!$A$9))","v":""},null,null,{"$f":"IF(V94=\"\",\"\",Eckdaten!$A$2-Y94+1)","v":""},"",null,{"$f":"IF(Tabelle1!$Z94=\"\",\"\",Eckdaten!$A$2-Tabelle1!$AB94+1)","v":""},"",null,{"$f":"IF(Tabelle1!$AC94=\"\",\"\",Eckdaten!$A$2-AE94+1)","v":""},"",{"$f":"SUM(Tabelle1!$S94,Tabelle1!$P94,Tabelle1!$M94,Tabelle1!$J94,Tabelle1!$G94,Tabelle1!$D94,AA94,AD94,X94)","v":0},""]
["37F",null,null,{"$f":"IF(Tabelle1!$C95=\"\",\"\",Eckdaten!$A$2-Tabelle1!$E95+1)","v":""},"",null,{"$f":"IF(Tabelle1!$F95=\"\",\"\",Eckdaten!$A$2-Tabelle1!$H95+1)","v":""},"",null,{"$f":"IF(Tabelle1!$I95=\"\",\"\",Eckdaten!$A$2-K95+1)","v":""},"",null,{"$f":"IF(L95=\"\",\"\",Eckdaten!$A$2-N95+1)","v":""},"",null,{"$f":"IF(Tabelle1!$O95=\"\",\"\",Eckdaten!$A$2-Q95+1)","v":""},"",null,{"$f":"IF(R95=\"\",\"\",Eckdaten!$A$2-T95+1)","v":""},"",{"$f":"IF(V95=\"\",\"\",V95+(W95*Eckdaten!$A$9))","v":""},null,null,{"$f":"IF(V95=\"\",\"\",Eckdaten!$A$2-Y95+1)","v":""},"",null,{"$f":"IF(Tabelle1!$Z95=\"\",\"\",Eckdaten!$A$2-Tabelle1!$AB95+1)","v":""},"",null,{"$f":"IF(Tabelle1!$AC95=\"\",\"\",Eckdaten!$A$2-AE95+1)","v":""},"",{"$f":"SUM(Tabelle1!$S95,Tabelle1!$P95,Tabelle1!$M95,Tabelle1!$J95,Tabelle1!$G95,Tabelle1!$D95,AA95,AD95,X95)","v":0},""]
["38F",null,null,{"$f":"IF(Tabelle1!$C96=\"\",\"\",Eckdaten!$A$2-Tabelle1!$E96+1)","v":""},"",null,{"$f":"IF(Tabelle1!$F96=\"\",\"\",Eckdaten!$A$2-Tabelle1!$H96+1)","v":""},"",null,{"$f":"IF(Tabelle1!$I96=\"\",\"\",Eckdaten!$A$2-K96+1)","v":""},"",null,{"$f":"IF(L96=\"\",\"\",Eckdaten!$A$2-N96+1)","v":""},"",null,{"$f":"IF(Tabelle1!$O96=\"\",\"\",Eckdaten!$A$2-Q96+1)","v":""},"",null,{"$f":"IF(R96=\"\",\"\",Eckdaten!$A$2-T96+1)","v":""},"",{"$f":"IF(V96=\"\",\"\",V96+(W96*Eckdaten!$A$9))","v":""},null,null,{"$f":"IF(V96=\"\",\"\",Eckdaten!$A$2-Y96+1)","v":""},"",null,{"$f":"IF(Tabelle1!$Z96=\"\",\"\",Eckdaten!$A$2-Tabelle1!$AB96+1)","v":""},"",null,{"$f":"IF(Tabelle1!$AC96=\"\",\"\",Eckdaten!$A$2-AE96+1)","v":""},"",{"$f":"SUM(Tabelle1!$S96,Tabelle1!$P96,Tabelle1!$M96,Tabelle1!$J96,Tabelle1!$G96,Tabelle1!$D96,AA96,AD96,X96)","v":0},""]
["39F",null,null,{"$f":"IF(Tabelle1!$C97=\"\",\"\",Eckdaten!$A$2-Tabelle1!$E97+1)","v":""},"",null,{"$f":"IF(Tabelle1!$F97=\"\",\"\",Eckdaten!$A$2-Tabelle1!$H97+1)","v":""},"",null,{"$f":"IF(Tabelle1!$I97=\"\",\"\",Eckdaten!$A$2-K97+1)","v":""},"",null,{"$f":"IF(L97=\"\",\"\",Eckdaten!$A$2-N97+1)","v":""},"",null,{"$f":"IF(Tabelle1!$O97=\"\",\"\",Eckdaten!$A$2-Q97+1)","v":""},"",null,{"$f":"IF(R97=\"\",\"\",Eckdaten!$A$2-T97+1)","v":""},"",{"$f":"IF(V97=\"\",\"\",V97+(W97*Eckdaten!$A$9))","v":""},null,null,{"$f":"IF(V97=\"\",\"\",Eckdaten!$A$2-Y97+1)","v":""},"",null,{"$f":"IF(Tabelle1!$Z97=\"\",\"\",Eckdaten!$A$2-Tabelle1!$AB97+1)","v":""},"",null,{"$f":"IF(Tabelle1!$AC97=\"\",\"\",Eckdaten!$A$2-AE97+1)","v":""},"",{"$f":"SUM(Tabelle1!$S97,Tabelle1!$P97,Tabelle1!$M97,Tabelle1!$J97,Tabelle1!$G97,Tabelle1!$D97,AA97,AD97,X97)","v":0},""]
["40F",null,null,{"$f":"IF(Tabelle1!$C98=\"\",\"\",Eckdaten!$A$2-Tabelle1!$E98+1)","v":""},"",null,{"$f":"IF(Tabelle1!$F98=\"\",\"\",Eckdaten!$A$2-Tabelle1!$H98+1)","v":""},"",null,{"$f":"IF(Tabelle1!$I98=\"\",\"\",Eckdaten!$A$2-K98+1)","v":""},"",null,{"$f":"IF(L98=\"\",\"\",Eckdaten!$A$2-N98+1)","v":""},"",null,{"$f":"IF(Tabelle1!$O98=\"\",\"\",Eckdaten!$A$2-Q98+1)","v":""},"",null,{"$f":"IF(R98=\"\",\"\",Eckdaten!$A$2-T98+1)","v":""},"",{"$f":"IF(V98=\"\",\"\",V98+(W98*Eckdaten!$A$9))","v":""},null,null,{"$f":"IF(V98=\"\",\"\",Eckdaten!$A$2-Y98+1)","v":""},"",null,{"$f":"IF(Tabelle1!$Z98=\"\",\"\",Eckdaten!$A$2-Tabelle1!$AB98+1)","v":""},"",null,{"$f":"IF(Tabelle1!$AC98=\"\",\"\",Eckdaten!$A$2-AE98+1)","v":""},"",{"$f":"SUM(Tabelle1!$S98,Tabelle1!$P98,Tabelle1!$M98,Tabelle1!$J98,Tabelle1!$G98,Tabelle1!$D98,AA98,AD98,X98)","v":0},""]
["41F",null,null,{"$f":"IF(Tabelle1!$C99=\"\",\"\",Eckdaten!$A$2-Tabelle1!$E99+1)","v":""},"",null,{"$f":"IF(Tabelle1!$F99=\"\",\"\",Eckdaten!$A$2-Tabelle1!$H99+1)","v":""},"",null,{"$f":"IF(Tabelle1!$I99=\"\",\"\",Eckdaten!$A$2-K99+1)","v":""},"",null,{"$f":"IF(L99=\"\",\"\",Eckdaten!$A$2-N99+1)","v":""},"",null,{"$f":"IF(Tabelle1!$O99=\"\",\"\",Eckdaten!$A$2-Q99+1)","v":""},"",null,{"$f":"IF(R99=\"\",\"\",Eckdaten!$A$2-T99+1)","v":""},"",{"$f":"IF(V99=\"\",\"\",V99+(W99*Eckdaten!$A$9))","v":""},null,null,{"$f":"IF(V99=\"\",\"\",Eckdaten!$A$2-Y99+1)","v":""},"",null,{"$f":"IF(Tabelle1!$Z99=\"\",\"\",Eckdaten!$A$2-Tabelle1!$AB99+1)","v":""},"",null,{"$f":"IF(Tabelle1!$AC99=\"\",\"\",Eckdaten!$A$2-AE99+1)","v":""},"",{"$f":"SUM(Tabelle1!$S99,Tabelle1!$P99,Tabelle1!$M99,Tabelle1!$J99,Tabelle1!$G99,Tabelle1!$D99,AA99,AD99,X99)","v":0},""]
["42F",null,null,{"$f":"IF(Tabelle1!$C100=\"\",\"\",Eckdaten!$A$2-Tabelle1!$E100+1)","v":""},"",null,{"$f":"IF(Tabelle1!$F100=\"\",\"\",Eckdaten!$A$2-Tabelle1!$H100+1)","v":""},"",null,{"$f":"IF(Tabelle1!$I100=\"\",\"\",Eckdaten!$A$2-K100+1)","v":""},"",null,{"$f":"IF(L100=\"\",\"\",Eckdaten!$A$2-N100+1)","v":""},"",null,{"$f":"IF(Tabelle1!$O100=\"\",\"\",Eckdaten!$A$2-Q100+1)","v":""},"",null,{"$f":"IF(R100=\"\",\"\",Eckdaten!$A$2-T100+1)","v":""},"",{"$f":"IF(V100=\"\",\"\",V100+(W100*Eckdaten!$A$9))","v":""},null,null,{"$f":"IF(V100=\"\",\"\",Eckdaten!$A$2-Y100+1)","v":""},"",null,{"$f":"IF(Tabelle1!$Z100=\"\",\"\",Eckdaten!$A$2-Tabelle1!$AB100+1)","v":""},"",null,{"$f":"IF(Tabelle1!$AC100=\"\",\"\",Eckdaten!$A$2-AE100+1)","v":""},"",{"$f":"SUM(Tabelle1!$S100,Tabelle1!$P100,Tabelle1!$M100,Tabelle1!$J100,Tabelle1!$G100,Tabelle1!$D100,AA100,AD100,X100)","v":0},""]
["43F",null,null,{"$f":"IF(Tabelle1!$C101=\"\",\"\",Eckdaten!$A$2-Tabelle1!$E101+1)","v":""},"",null,{"$f":"IF(Tabelle1!$F101=\"\",\"\",Eckdaten!$A$2-Tabelle1!$H101+1)","v":""},"",null,{"$f":"IF(Tabelle1!$I101=\"\",\"\",Eckdaten!$A$2-K101+1)","v":""},"",null,{"$f":"IF(L101=\"\",\"\",Eckdaten!$A$2-N101+1)","v":""},"",null,{"$f":"IF(Tabelle1!$O101=\"\",\"\",Eckdaten!$A$2-Q101+1)","v":""},"",null,{"$f":"IF(R101=\"\",\"\",Eckdaten!$A$2-T101+1)","v":""},"",{"$f":"IF(V101=\"\",\"\",V101+(W101*Eckdaten!$A$9))","v":""},null,null,{"$f":"IF(V101=\"\",\"\",Eckdaten!$A$2-Y101+1)","v":""},"",null,{"$f":"IF(Tabelle1!$Z101=\"\",\"\",Eckdaten!$A$2-Tabelle1!$AB101+1)","v":""},"",null,{"$f":"IF(Tabelle1!$AC101=\"\",\"\",Eckdaten!$A$2-AE101+1)","v":""},"",{"$f":"SUM(Tabelle1!$S101,Tabelle1!$P101,Tabelle1!$M101,Tabelle1!$J101,Tabelle1!$G101,Tabelle1!$D101,AA101,AD101,X101)","v":0},""]
["44F",null,null,{"$f":"IF(Tabelle1!$C102=\"\",\"\",Eckdaten!$A$2-Tabelle1!$E102+1)","v":""},"",null,{"$f":"IF(Tabelle1!$F102=\"\",\"\",Eckdaten!$A$2-Tabelle1!$H102+1)","v":""},"",null,{"$f":"IF(Tabelle1!$I102=\"\",\"\",Eckdaten!$A$2-K102+1)","v":""},"",null,{"$f":"IF(L102=\"\",\"\",Eckdaten!$A$2-N102+1)","v":""},"",null,{"$f":"IF(Tabelle1!$O102=\"\",\"\",Eckdaten!$A$2-Q102+1)","v":""},"",null,{"$f":"IF(R102=\"\",\"\",Eckdaten!$A$2-T102+1)","v":""},"",{"$f":"IF(V102=\"\",\"\",V102+(W102*Eckdaten!$A$9))","v":""},null,null,{"$f":"IF(V102=\"\",\"\",Eckdaten!$A$2-Y102+1)","v":""},"",null,{"$f":"IF(Tabelle1!$Z102=\"\",\"\",Eckdaten!$A$2-Tabelle1!$AB102+1)","v":""},"",null,{"$f":"IF(Tabelle1!$AC102=\"\",\"\",Eckdaten!$A$2-AE102+1)","v":""},"",{"$f":"SUM(Tabelle1!$S102,Tabelle1!$P102,Tabelle1!$M102,Tabelle1!$J102,Tabelle1!$G102,Tabelle1!$D102,AA102,AD102,X102)","v":0},""]
["45F",null,null,{"$f":"IF(Tabelle1!$C103=\"\",\"\",Eckdaten!$A$2-Tabelle1!$E103+1)","v":""},"",null,{"$f":"IF(Tabelle1!$F103=\"\",\"\",Eckdaten!$A$2-Tabelle1!$H103+1)","v":""},"",null,{"$f":"IF(Tabelle1!$I103=\"\",\"\",Eckdaten!$A$2-K103+1)","v":""},"",null,{"$f":"IF(L103=\"\",\"\",Eckdaten!$A$2-N103+1)","v":""},"",null,{"$f":"IF(Tabelle1!$O103=\"\",\"\",Eckdaten!$A$2-Q103+1)","v":""},"",null,{"$f":"IF(R103=\"\",\"\",Eckdaten!$A$2-T103+1)","v":""},"",{"$f":"IF(V103=\"\",\"\",V103+(W103*Eckdaten!$A$9))","v":""},null,null,{"$f":"IF(V103=\"\",\"\",Eckdaten!$A$2-Y103+1)","v":""},"",null,{"$f":"IF(Tabelle1!$Z103=\"\",\"\",Eckdaten!$A$2-Tabelle1!$AB103+1)","v":""},"",null,{"$f":"IF(Tabelle1!$AC103=\"\",\"\",Eckdaten!$A$2-AE103+1)","v":""},"",{"$f":"SUM(Tabelle1!$S103,Tabelle1!$P103,Tabelle1!$M103,Tabelle1!$J103,Tabelle1!$G103,Tabelle1!$D103,AA103,AD103,X103)","v":0},""]
["46F",null,null,{"$f":"IF(Tabelle1!$C104=\"\",\"\",Eckdaten!$A$2-Tabelle1!$E104+1)","v":""},"",null,{"$f":"IF(Tabelle1!$F104=\"\",\"\",Eckdaten!$A$2-Tabelle1!$H104+1)","v":""},"",null,{"$f":"IF(Tabelle1!$I104=\"\",\"\",Eckdaten!$A$2-K104+1)","v":""},"",null,{"$f":"IF(L104=\"\",\"\",Eckdaten!$A$2-N104+1)","v":""},"",null,{"$f":"IF(Tabelle1!$O104=\"\",\"\",Eckdaten!$A$2-Q104+1)","v":""},"",null,{"$f":"IF(R104=\"\",\"\",Eckdaten!$A$2-T104+1)","v":""},"",{"$f":"IF(V104=\"\",\"\",V104+(W104*Eckdaten!$A$9))","v":""},null,null,{"$f":"IF(V104=\"\",\"\",Eckdaten!$A$2-Y104+1)","v":""},"",null,{"$f":"IF(Tabelle1!$Z104=\"\",\"\",Eckdaten!$A$2-Tabelle1!$AB104+1)","v":""},"",null,{"$f":"IF(Tabelle1!$AC104=\"\",\"\",Eckdaten!$A$2-AE104+1)","v":""},"",{"$f":"SUM(Tabelle1!$S104,Tabelle1!$P104,Tabelle1!$M104,Tabelle1!$J104,Tabelle1!$G104,Tabelle1!$D104,AA104,AD104,X104)","v":0},""]
["47F",null,null,{"$f":"IF(Tabelle1!$C105=\"\",\"\",Eckdaten!$A$2-Tabelle1!$E105+1)","v":""},"",null,{"$f":"IF(Tabelle1!$F105=\"\",\"\",Eckdaten!$A$2-Tabelle1!$H105+1)","v":""},"",null,{"$f":"IF(Tabelle1!$I105=\"\",\"\",Eckdaten!$A$2-K105+1)","v":""},"",null,{"$f":"IF(L105=\"\",\"\",Eckdaten!$A$2-N105+1)","v":""},"",null,{"$f":"IF(Tabelle1!$O105=\"\",\"\",Eckdaten!$A$2-Q105+1)","v":""},"",null,{"$f":"IF(R105=\"\",\"\",Eckdaten!$A$2-T105+1)","v":""},"",{"$f":"IF(V105=\"\",\"\",V105+(W105*Eckdaten!$A$9))","v":""},null,null,{"$f":"IF(V105=\"\",\"\",Eckdaten!$A$2-Y105+1)","v":""},"",null,{"$f":"IF(Tabelle1!$Z105=\"\",\"\",Eckdaten!$A$2-Tabelle1!$AB105+1)","v":""},"",null,{"$f":"IF(Tabelle1!$AC105=\"\",\"\",Eckdaten!$A$2-AE105+1)","v":""},"",{"$f":"SUM(Tabelle1!$S105,Tabelle1!$P105,Tabelle1!$M105,Tabelle1!$J105,Tabelle1!$G105,Tabelle1!$D105,AA105,AD105,X105)","v":0},""]
["48F",null,null,{"$f":"IF(Tabelle1!$C106=\"\",\"\",Eckdaten!$A$2-Tabelle1!$E106+1)","v":""},"",null,{"$f":"IF(Tabelle1!$F106=\"\",\"\",Eckdaten!$A$2-Tabelle1!$H106+1)","v":""},"",null,{"$f":"IF(Tabelle1!$I106=\"\",\"\",Eckdaten!$A$2-K106+1)","v":""},"",null,{"$f":"IF(L106=\"\",\"\",Eckdaten!$A$2-N106+1)","v":""},"",null,{"$f":"IF(Tabelle1!$O106=\"\",\"\",Eckdaten!$A$2-Q106+1)","v":""},"",null,{"$f":"IF(R106=\"\",\"\",Eckdaten!$A$2-T106+1)","v":""},"",{"$f":"IF(V106=\"\",\"\",V106+(W106*Eckdaten!$A$9))","v":""},null,null,{"$f":"IF(V106=\"\",\"\",Eckdaten!$A$2-Y106+1)","v":""},"",null,{"$f":"IF(Tabelle1!$Z106=\"\",\"\",Eckdaten!$A$2-Tabelle1!$AB106+1)","v":""},"",null,{"$f":"IF(Tabelle1!$AC106=\"\",\"\",Eckdaten!$A$2-AE106+1)","v":""},"",{"$f":"SUM(Tabelle1!$S106,Tabelle1!$P106,Tabelle1!$M106,Tabelle1!$J106,Tabelle1!$G106,Tabelle1!$D106,AA106,AD106,X106)","v":0},""]
["49F",null,null,{"$f":"IF(Tabelle1!$C107=\"\",\"\",Eckdaten!$A$2-Tabelle1!$E107+1)","v":""},"",null,{"$f":"IF(Tabelle1!$F107=\"\",\"\",Eckdaten!$A$2-Tabelle1!$H107+1)","v":""},"",null,{"$f":"IF(Tabelle1!$I107=\"\",\"\",Eckdaten!$A$2-K107+1)","v":""},"",null,{"$f":"IF(L107=\"\",\"\",Eckdaten!$A$2-N107+1)","v":""},"",null,{"$f":"IF(Tabelle1!$O107=\"\",\"\",Eckdaten!$A$2-Q107+1)","v":""},"",null,{"$f":"IF(R107=\"\",\"\",Eckdaten!$A$2-T107+1)","v":""},"",{"$f":"IF(V107=\"\",\"\",V107+(W107*Eckdaten!$A$9))","v":""},null,null,{"$f":"IF(V107=\"\",\"\",Eckdaten!$A$2-Y107+1)","v":""},"",null,{"$f":"IF(Tabelle1!$Z107=\"\",\"\",Eckdaten!$A$2-Tabelle1!$AB107+1)","v":""},"",null,{"$f":"IF(Tabelle1!$AC107=\"\",\"\",Eckdaten!$A$2-AE107+1)","v":""},"",{"$f":"SUM(Tabelle1!$S107,Tabelle1!$P107,Tabelle1!$M107,Tabelle1!$J107,Tabelle1!$G107,Tabelle1!$D107,AA107,AD107,X107)","v":0},""]
["50F",null,null,{"$f":"IF(Tabelle1!$C108=\"\",\"\",Eckdaten!$A$2-Tabelle1!$E108+1)","v":""},"",null,{"$f":"IF(Tabelle1!$F108=\"\",\"\",Eckdaten!$A$2-Tabelle1!$H108+1)","v":""},"",null,{"$f":"IF(Tabelle1!$I108=\"\",\"\",Eckdaten!$A$2-K108+1)","v":""},"",null,{"$f":"IF(L108=\"\",\"\",Eckdaten!$A$2-N108+1)","v":""},"",null,{"$f":"IF(Tabelle1!$O108=\"\",\"\",Eckdaten!$A$2-Q108+1)","v":""},"",null,{"$f":"IF(R108=\"\",\"\",Eckdaten!$A$2-T108+1)","v":""},"",{"$f":"IF(V108=\"\",\"\",V108+(W108*Eckdaten!$A$9))","v":""},null,null,{"$f":"IF(V108=\"\",\"\",Eckdaten!$A$2-Y108+1)","v":""},"",null,{"$f":"IF(Tabelle1!$Z108=\"\",\"\",Eckdaten!$A$2-Tabelle1!$AB108+1)","v":""},"",null,{"$f":"IF(Tabelle1!$AC108=\"\",\"\",Eckdaten!$A$2-AE108+1)","v":""},"",{"$f":"SUM(Tabelle1!$S108,Tabelle1!$P108,Tabelle1!$M108,Tabelle1!$J108,Tabelle1!$G108,Tabelle1!$D108,AA108,AD108,X108)","v":0},""]
[]
[]
[]
["TEAM-Wertung"]
["Platz 1",{"$f":"VLOOKUP(Teams!M4,Teams!$F$3:$K$61,2,FALSE)","v":"Team 6"},{"$f":"IF(Teams!O8>4,\"ACHTUNG, RECHNUNG FALSCH!!! IN TABELLE 'TEAMS' ÜBERPRÜFEN!!!\",\"\")","v":""}]
[null,{"$f":"VLOOKUP(Tabelle1!$B$113,Teams!$A$3:$K$61,8,FALSE)","v":"Kastl Max"}]
[null,{"$f":"VLOOKUP(Tabelle1!$B$113,Teams!$A$3:$K$61,9,FALSE)","v":"Marina Stöttner"},"mit einer Gesamtpunktezahl von"]
[null,{"$f":"VLOOKUP(Tabelle1!$B$113,Teams!$A$3:$K$61,10,FALSE)","v":"Stefan Obergruber"},{"$f":"VLOOKUP(Tabelle1!$B$113,Teams!$A$3:$K$61,11,FALSE)","v":929}]
["Platz 2",{"$f":"VLOOKUP(Teams!M5,Teams!$F$3:$K$61,2,FALSE)","v":"Team 4"}]
[null,{"$f":"VLOOKUP(Tabelle1!$B$117,Teams!$A$3:$K$61,8,FALSE)","v":"Stefan Lehner"}]
[null,{"$f":"VLOOKUP(Tabelle1!$B$117,Teams!$A$3:$K$61,9,FALSE)","v":"Dominik Engleder"},"mit einer Gesamtpunktezahl von"]
[null,{"$f":"VLOOKUP(Tabelle1!$B$117,Teams!$A$3:$K$61,10,FALSE)","v":"Christian Pühringer"},{"$f":"VLOOKUP(Tabelle1!$B$117,Teams!$A$3:$K$61,11,FALSE)","v":914}]
["Platz 3",{"$f":"VLOOKUP(Teams!M6,Teams!F3:K61,2,FALSE)","v":"Team 5"}]
[null,{"$f":"VLOOKUP(Tabelle1!$B$121,Teams!$A$3:$K$61,8,FALSE)","v":"Patrick Martha"}]
[null,{"$f":"VLOOKUP(Tabelle1!$B$121,Teams!$A$3:$K$61,9,FALSE)","v":"David Gruber"},"mit einer Gesamtpunktezahl von"]
[null,{"$f":"VLOOKUP(Tabelle1!$B$121,Teams!$A$3:$K$61,10,FALSE)","v":"Alois Matha"},{"$f":"VLOOKUP(Tabelle1!$B$121,Teams!$A$3:$K$61,11,FALSE)","v":896}]
["Platz 4",{"$f":"VLOOKUP(Teams!M7,Teams!F3:K61,2,FALSE)","v":"Team 2"}]
[null,{"$f":"VLOOKUP(Tabelle1!$B$125,Teams!$A$3:$K$61,8,FALSE)","v":"Marco Hofstätter"}]
[null,{"$f":"VLOOKUP(Tabelle1!$B$125,Teams!$A$3:$K$61,9,FALSE)","v":"Bastian Enzenhofer"},"mit einer Gesamtpunktezahl von"]
[null,{"$f":"VLOOKUP(Tabelle1!$B$125,Teams!$A$3:$K$61,10,FALSE)","v":"Erich Haider"},{"$f":"VLOOKUP(Tabelle1!$B$125,Teams!$A$3:$K$61,11,FALSE)","v":890}]

{"sheet":"Teams","index":1,"n_rows":61,"n_cols":20,"rows_kept":61,"cut":false,"hidden":false,"merged":[[2,16,2,17],[2,18,2,19]]}
["TEAMS"]
[null,null,null,null,null,null,null,null,null,null,null,null,"Reihung Suchkriterien",null,null,null,"Verfügbare Namen"]
["Team 1","Starter","6M","17M","16M",null,{"$f":"A3","v":"Team 1"},{"$f":"C4","v":"Thomas Altmann"},{"$f":"D4","v":"Christian Natschläger"},{"$f":"E4","v":"Markus Kraml"},{"$f":"F5","v":778},null,"1. 4 Plätze",null,null,null,"Männer",null,"Frauen"]
["Rang","Namen",{"$f":"IF(ISNA(VLOOKUP(C3,Tabelle1!$A$5:$AG$153,2,FALSE)),\"\",VLOOKUP(C3,Tabelle1!$A$5:$AG$153,2,FALSE))","v":"Thomas Altmann"},{"$f":"IF(ISNA(VLOOKUP(D3,Tabelle1!$A$5:$AG$153,2,FALSE)),\"\",VLOOKUP(D3,Tabelle1!$A$5:$AG$153,2,FALSE))","v":"Christian Natschläger"},{"$f":"IF(ISNA(VLOOKUP(E3,Tabelle1!$A$5:$AG$153,2,FALSE)),\"\",VLOOKUP(E3,Tabelle1!$A$5:$AG$153,2,FALSE))","v":"Markus Kraml"},"Gesamtpunkte",null,null,null,null,null,null,{"$f":"MAX(F3:F61)","v":929},null,{"$f":"COUNTIF(M4:M7,M4)","v":1},null,{"$f":"Tabelle1!A5","v":"1M"},{"$f":"Tabelle1!B5","v":"Stefan Lehner"},{"$f":"Tabelle1!A59","v":"1F"},{"$f":"Tabelle1!B59","v":"Katharina Strasser"}]
[{"$f":"IF(F5=0,\"\",RANK(F5,$F$2:$F$1603,0))","v":6},"Punkte",{"$f":"IF(ISNA(VLOOKUP(C3,Tabelle1!$A$5:$AG$153,32,FALSE)),0,VLOOKUP(C3,Tabelle1!$A$5:$AG$153,32,FALSE))","v":265},{"$f":"IF(ISNA(VLOOKUP(D3,Tabelle1!$A$5:$AG$153,32,FALSE)),0,VLOOKUP(D3,Tabelle1!$A$5:$AG$153,32,FALSE))","v":265},{"$f":"IF(ISNA(VLOOKUP(E3,Tabelle1!$A$5:$AG$153,32,FALSE)),0,VLOOKUP(E3,Tabelle1!$A$5:$AG$153,32,FALSE))","v":248},{"$f":"SUM(C5+D5+E5)","v":778},{"$f":"G3","v":"Team 1"},{"$f":"H3","v":"Thomas Altmann"},{"$f":"I3","v":"Christian Natschläger"},"Markus Kraml",778,null,{"$f":"LARGE($F$4:$F$104,2)","v":914},null,{"$f":"COUNTIF(M4:M7,M5)","v":1},null,{"$f":"Tabelle1!A6","v":"2M"},{"$f":"Tabelle1!B6","v":"David Gruber"},{"$f":"Tabelle1!A60","v":"2F"},{"$f":"Tabelle1!B60","v":"Magdalena Schürz"}]
[null,null,null,null,null,null,null,null,null,null,null,null,{"$f":"LARGE($F$4:$F$104,3)","v":896},null,{"$f":"COUNTIF(M4:M7,M6)","v":1},null,{"$f":"Tabelle1!A7","v":"3M"},{"$f":"Tabelle1!B7","v":"Alois Matha"},{"$f":"Tabelle1!A61","v":"3F"},{"$f":"Tabelle1!B61","v":"Marina Stöttner"}]
["Team 2","Starter","9M","19M","18M",null,{"$f":"A7","v":"Team 2"},{"$f":"C8","v":"Marco Hofstätter"},{"$f":"D8","v":"Bastian Enzenhofer"},{"$f":"E8","v":"Erich Haider"},{"$f":"F9","v":890},null,{"$f":"LARGE($F$4:$F$104,4)","v":890},null,{"$f":"COUNTIF(M4:M7,M7)","v":1},null,{"$f":"Tabelle1!A8","v":"4M"},{"$f":"Tabelle1!B8","v":"Martin Reisinger"},{"$f":"Tabelle1!A62","v":"4F"},{"$f":"Tabelle1!B62","v":0}]
["Rang","Namen",{"$f":"IF(ISNA(VLOOKUP(C7,Tabelle1!$A$5:$AG$153,2,FALSE)),\"\",VLOOKUP(C7,Tabelle1!$A$5:$AG$153,2,FALSE))","v":"Marco Hofstätter"},{"$f":"IF(ISNA(VLOOKUP(D7,Tabelle1!$A$5:$AG$153,2,FALSE)),\"\",VLOOKUP(D7,Tabelle1!$A$5:$AG$153,2,FALSE))","v":"Bastian Enzenhofer"},{"$f":"IF(ISNA(VLOOKUP(E7,Tabelle1!$A$5:$AG$153,2,FALSE)),\"\",VLOOKUP(E7,Tabelle1!$A$5:$AG$153,2,FALSE))","v":"Erich Haider"},"Gesamtpunkte",null,null,null,null,null,null,null,null,{"$f":"SUM(O4:O7)","v":4},null,{"$f":"Tabelle1!A9","v":"5M"},{"$f":"Tabelle1!B9","v":0},{"$f":"Tabelle1!A63","v":"5F"},{"$f":"Tabelle1!B63","v":0}]
[{"$f":"IF(F9=0,\"\",RANK(F9,$F$2:$F$1603,0))","v":4},"Punkte",{"$f":"IF(ISNA(VLOOKUP(C7,Tabelle1!$A$5:$AG$153,32,FALSE)),0,VLOOKUP(C7,Tabelle1!$A$5:$AG$153,32,FALSE))","v":318},{"$f":"IF(ISNA(VLOOKUP(D7,Tabelle1!$A$5:$AG$153,32,FALSE)),0,VLOOKUP(D7,Tabelle1!$A$5:$AG$153,32,FALSE))","v":284},{"$f":"IF(ISNA(VLOOKUP(E7,Tabelle1!$A$5:$AG$153,32,FALSE)),0,VLOOKUP(E7,Tabelle1!$A$5:$AG$153,32,FALSE))","v":288},{"$f":"SUM(C9+D9+E9)","v":890},{"$f":"G7","v":"Team 2"},{"$f":"H7","v":"Marco Hofstätter"},{"$f":"I7","v":"Bastian Enzenhofer"},"Erich Haider",890,null,null,null,null,null,{"$f":"Tabelle1!A10","v":"6M"},{"$f":"Tabelle1!B10","v":"Thomas Altmann"},{"$f":"Tabelle1!A64","v":"6F"},{"$f":"Tabelle1!B64","v":0}]
[null,null,null,null,null,null,null,null,null,null,null,null,null,null,null,null,{"$f":"Tabelle1!A11","v":"7M"},{"$f":"Tabelle1!B11","v":"Stefan Obergruber"},{"$f":"Tabelle1!A65","v":"7F"},{"$f":"Tabelle1!B65","v":0}]
["Team 3","Starter","14M","13M","4M",null,{"$f":"A11","v":"Team 3"},{"$f":"C12","v":"Günther Pichler"},{"$f":"D12","v":"Thomas Lindorfer"},{"$f":"E12","v":"Martin Reisinger"},{"$f":"F13","v":829},null,null,null,null,null,{"$f":"Tabelle1!A12","v":"8M"},{"$f":"Tabelle1!B12","v":"Kastl Max"},{"$f":"Tabelle1!A66","v":"8F"},{"$f":"Tabelle1!B66","v":0}]
["Rang","Namen",{"$f":"IF(ISNA(VLOOKUP(C11,Tabelle1!$A$5:$AG$153,2,FALSE)),\"\",VLOOKUP(C11,Tabelle1!$A$5:$AG$153,2,FALSE))","v":"Günther Pichler"},{"$f":"IF(ISNA(VLOOKUP(D11,Tabelle1!$A$5:$AG$153,2,FALSE)),\"\",VLOOKUP(D11,Tabelle1!$A$5:$AG$153,2,FALSE))","v":"Thomas Lindorfer"},{"$f":"IF(ISNA(VLOOKUP(E11,Tabelle1!$A$5:$AG$153,2,FALSE)),\"\",VLOOKUP(E11,Tabelle1!$A$5:$AG$153,2,FALSE))","v":"Martin Reisinger"},"Gesamtpunkte",null,null,null,null,null,null,null,null,null,null,{"$f":"Tabelle1!A13","v":"9M"},{"$f":"Tabelle1!B13","v":"Marco Hofstätter"},{"$f":"Tabelle1!A67","v":"9F"},{"$f":"Tabelle1!B67","v":0}]
[{"$f":"IF(F13=0,\"\",RANK(F13,$F$2:$F$1603,0))","v":5},"Punkte",{"$f":"IF(ISNA(VLOOKUP(C11,Tabelle1!$A$5:$AG$153,32,FALSE)),0,VLOOKUP(C11,Tabelle1!$A$5:$AG$153,32,FALSE))","v":256},{"$f":"IF(ISNA(VLOOKUP(D11,Tabelle1!$A$5:$AG$153,32,FALSE)),0,VLOOKUP(D11,Tabelle1!$A$5:$AG$153,32,FALSE))","v":318},{"$f":"IF(ISNA(VLOOKUP(E11,Tabelle1!$A$5:$AG$153,32,FALSE)),0,VLOOKUP(E11,Tabelle1!$A$5:$AG$153,32,FALSE))","v":255},{"$f":"SUM(C13+D13+E13)","v":829},{"$f":"G11","v":"Team 3"},{"$f":"H11","v":"Günther Pichler"},{"$f":"I11","v":"Thomas Lindorfer"},"Martin Reisinger",829,null,null,null,null,null,{"$f":"Tabelle1!A14","v":"10M"},{"$f":"Tabelle1!B14","v":0},{"$f":"Tabelle1!A68","v":"10F"},{"$f":"Tabelle1!B68","v":0}]
[null,null,null,null,null,null,null,null,null,null,null,null,null,null,null,null,{"$f":"Tabelle1!A15","v":"11M"},{"$f":"Tabelle1!B15","v":"Christian Pühringer"},{"$f":"Tabelle1!A69","v":"11F"},{"$f":"Tabelle1!B69","v":0}]
["Team 4","Starter","1M","15M","11m",null,{"$f":"A15","v":"Team 4"},{"$f":"C16","v":"Stefan Lehner"},{"$f":"D16","v":"Dominik Engleder"},{"$f":"E16","v":"Christian Pühringer"},{"$f":"F17","v":914},null,null,null,null,null,{"$f":"Tabelle1!A16","v":"12M"},{"$f":"Tabelle1!B16","v":0},{"$f":"Tabelle1!A70","v":"12F"},{"$f":"Tabelle1!B70","v":0}]
["Rang","Namen",{"$f":"IF(ISNA(VLOOKUP(C15,Tabelle1!$A$5:$AG$153,2,FALSE)),\"\",VLOOKUP(C15,Tabelle1!$A$5:$AG$153,2,FALSE))","v":"Stefan Lehner"},{"$f":"IF(ISNA(VLOOKUP(D15,Tabelle1!$A$5:$AG$153,2,FALSE)),\"\",VLOOKUP(D15,Tabelle1!$A$5:$AG$153,2,FALSE))","v":"Dominik Engleder"},{"$f":"IF(ISNA(VLOOKUP(E15,Tabelle1!$A$5:$AG$153,2,FALSE)),\"\",VLOOKUP(E15,Tabelle1!$A$5:$AG$153,2,FALSE))","v":"Christian Pühringer"},"Gesamtpunkte",null,null,null,null,null,null,null,null,null,null,{"$f":"Tabelle1!A17","v":"13M"},{"$f":"Tabelle1!B17","v":"Thomas Lindorfer"},{"$f":"Tabelle1!A71","v":"13F"},{"$f":"Tabelle1!B71","v":0}]
[{"$f":"IF(F17=0,\"\",RANK(F17,$F$2:$F$1603,0))","v":2},"Punkte",{"$f":"IF(ISNA(VLOOKUP(C15,Tabelle1!$A$5:$AG$153,32,FALSE)),0,VLOOKUP(C15,Tabelle1!$A$5:$AG$153,32,FALSE))","v":325},{"$f":"IF(ISNA(VLOOKUP(D15,Tabelle1!$A$5:$AG$153,32,FALSE)),0,VLOOKUP(D15,Tabelle1!$A$5:$AG$153,32,FALSE))","v":325},{"$f":"IF(ISNA(VLOOKUP(E15,Tabelle1!$A$5:$AG$153,32,FALSE)),0,VLOOKUP(E15,Tabelle1!$A$5:$AG$153,32,FALSE))","v":264},{"$f":"SUM(C17+D17+E17)","v":914},{"$f":"G15","v":"Team 4"},{"$f":"H15","v":"Stefan Lehner"},{"$f":"I15","v":"Dominik Engleder"},"Christian Pühringer",914,null,null,null,null,null,{"$f":"Tabelle1!A18","v":"14M"},{"$f":"Tabelle1!B18","v":"Günther Pichler"},{"$f":"Tabelle1!A72","v":"14F"},{"$f":"Tabelle1!B72","v":0}]
[null,null,null,null,null,null,null,null,null,null,null,null,null,null,null,null,{"$f":"Tabelle1!A19","v":"15M"},{"$f":"Tabelle1!B19","v":"Dominik Engleder"},{"$f":"Tabelle1!A73","v":"15F"},{"$f":"Tabelle1!B73","v":0}]
["Team 5","Starter","20m","2m","3m",null,{"$f":"A19","v":"Team 5"},{"$f":"C20","v":"Patrick Martha"},{"$f":"D20","v":"David Gruber"},{"$f":"E20","v":"Alois Matha"},{"$f":"F21","v":896},null,null,null,null,null,{"$f":"Tabelle1!A20","v":"16M"},{"$f":"Tabelle1!B20","v":"Markus Kraml"},{"$f":"Tabelle1!A74","v":"16F"},{"$f":"Tabelle1!B74","v":0}]
["Rang","Namen",{"$f":"IF(ISNA(VLOOKUP(C19,Tabelle1!$A$5:$AG$153,2,FALSE)),\"\",VLOOKUP(C19,Tabelle1!$A$5:$AG$153,2,FALSE))","v":"Patrick Martha"},{"$f":"IF(ISNA(VLOOKUP(D19,Tabelle1!$A$5:$AG$153,2,FALSE)),\"\",VLOOKUP(D19,Tabelle1!$A$5:$AG$153,2,FALSE))","v":"David Gruber"},{"$f":"IF(ISNA(VLOOKUP(E19,Tabelle1!$A$5:$AG$153,2,FALSE)),\"\",VLOOKUP(E19,Tabelle1!$A$5:$AG$153,2,FALSE))","v":"Alois Matha"},"Gesamtpunkte",null,null,null,null,null,null,null,null,null,null,{"$f":"Tabelle1!A21","v":"17M"},{"$f":"Tabelle1!B21","v":"Christian Natschläger"},{"$f":"Tabelle1!A75","v":"17F"},{"$f":"Tabelle1!B75","v":0}]
[{"$f":"IF(F21=0,\"\",RANK(F21,$F$2:$F$1603,0))","v":3},"Punkte",{"$f":"IF(ISNA(VLOOKUP(C19,Tabelle1!$A$5:$AG$153,32,FALSE)),0,VLOOKUP(C19,Tabelle1!$A$5:$AG$153,32,FALSE))","v":293},{"$f":"IF(ISNA(VLOOKUP(D19,Tabelle1!$A$5:$AG$153,32,FALSE)),0,VLOOKUP(D19,Tabelle1!$A$5:$AG$153,32,FALSE))","v":301},{"$f":"IF(ISNA(VLOOKUP(E19,Tabelle1!$A$5:$AG$153,32,FALSE)),0,VLOOKUP(E19,Tabelle1!$A$5:$AG$153,32,FALSE))","v":302},{"$f":"SUM(C21+D21+E21)","v":896},{"$f":"G19","v":"Team 5"},{"$f":"H19","v":"Patrick Martha"},{"$f":"I19","v":"David Gruber"},"Alois Matha",896,null,null,null,null,null,{"$f":"Tabelle1!A22","v":"18M"},{"$f":"Tabelle1!B22","v":"Erich Haider"},{"$f":"Tabelle1!A76","v":"18F"},{"$f":"Tabelle1!B76","v":0}]
[null,null,null,null,null,null,null,null,null,null,null,null,null,null,null,null,{"$f":"Tabelle1!A23","v":"19M"},{"$f":"Tabelle1!B23","v":"Bastian Enzenhofer"},{"$f":"Tabelle1!A77","v":"19F"},{"$f":"Tabelle1!B77","v":0}]
["Team 6","Starter","8m","3f","7m",null,{"$f":"A23","v":"Team 6"},{"$f":"C24","v":"Kastl Max"},{"$f":"D24","v":"Marina Stöttner"},{"$f":"E24","v":"Stefan Obergruber"},{"$f":"F25","v":929},null,null,null,null,null,{"$f":"Tabelle1!A24","v":"20M"},{"$f":"Tabelle1!B24","v":"Patrick Martha"},{"$f":"Tabelle1!A78","v":"20F"},{"$f":"Tabelle1!B78","v":0}]
["Rang","Namen",{"$f":"IF(ISNA(VLOOKUP(C23,Tabelle1!$A$5:$AG$153,2,FALSE)),\"\",VLOOKUP(C23,Tabelle1!$A$5:$AG$153,2,FALSE))","v":"Kastl Max"},{"$f":"IF(ISNA(VLOOKUP(D23,Tabelle1!$A$5:$AG$153,2,FALSE)),\"\",VLOOKUP(D23,Tabelle1!$A$5:$AG$153,2,FALSE))","v":"Marina Stöttner"},{"$f":"IF(ISNA(VLOOKUP(E23,Tabelle1!$A$5:$AG$153,2,FALSE)),\"\",VLOOKUP(E23,Tabelle1!$A$5:$AG$153,2,FALSE))","v":"Stefan Obergruber"},"Gesamtpunkte",null,null,null,null,null,null,null,null,null,null,{"$f":"Tabelle1!A25","v":"21M"},{"$f":"Tabelle1!B25","v":"Mario Gahleitern"},{"$f":"Tabelle1!A79","v":"21F"},{"$f":"Tabelle1!B79","v":0}]
[{"$f":"IF(F25=0,\"\",RANK(F25,$F$2:$F$1603,0))","v":1},"Punkte",{"$f":"IF(ISNA(VLOOKUP(C23,Tabelle1!$A$5:$AG$153,32,FALSE)),0,VLOOKUP(C23,Tabelle1!$A$5:$AG$153,32,FALSE))","v":304},{"$f":"IF(ISNA(VLOOKUP(D23,Tabelle1!$A$5:$AG$153,32,FALSE)),0,VLOOKUP(D23,Tabelle1!$A$5:$AG$153,32,FALSE))","v":347},{"$f":"IF(ISNA(VLOOKUP(E23,Tabelle1!$A$5:$AG$153,32,FALSE)),0,VLOOKUP(E23,Tabelle1!$A$5:$AG$153,32,FALSE))","v":278},{"$f":"SUM(C25+D25+E25)","v":929},{"$f":"G23","v":"Team 6"},{"$f":"H23","v":"Kastl Max"},{"$f":"I23","v":"Marina Stöttner"},"Stefan Obergruber",929,null,null,null,null,null,{"$f":"Tabelle1!A26","v":"22M"},{"$f":"Tabelle1!B26","v":"Kevin Raab"},{"$f":"Tabelle1!A80","v":"22F"},{"$f":"Tabelle1!B80","v":0}]
[null,null,null,null,null,null,null,null,null,null,null,null,null,null,null,null,{"$f":"Tabelle1!A27","v":"23M"},{"$f":"Tabelle1!B27","v":0},{"$f":"Tabelle1!A81","v":"23F"},{"$f":"Tabelle1!B81","v":0}]
["Team 7","Starter",null,null,null,null,{"$f":"A27","v":"Team 7"},{"$f":"C28","v":""},{"$f":"D28","v":""},{"$f":"E28","v":""},{"$f":"F29","v":0},null,null,null,null,null,{"$f":"Tabelle1!A28","v":"24M"},{"$f":"Tabelle1!B28","v":0},{"$f":"Tabelle1!A82","v":"24F"},{"$f":"Tabelle1!B82","v":0}]
["Rang","Namen",{"$f":"IF(ISNA(VLOOKUP(C27,Tabelle1!$A$5:$AG$153,2,FALSE)),\"\",VLOOKUP(C27,Tabelle1!$A$5:$AG$153,2,FALSE))","v":""},{"$f":"IF(ISNA(VLOOKUP(D27,Tabelle1!$A$5:$AG$153,2,FALSE)),\"\",VLOOKUP(D27,Tabelle1!$A$5:$AG$153,2,FALSE))","v":""},{"$f":"IF(ISNA(VLOOKUP(E27,Tabelle1!$A$5:$AG$153,2,FALSE)),\"\",VLOOKUP(E27,Tabelle1!$A$5:$AG$153,2,FALSE))","v":""},"Gesamtpunkte",null,null,null,null,null,null,null,null,null,null,{"$f":"Tabelle1!A29","v":"25M"},{"$f":"Tabelle1!B29","v":0},{"$f":"Tabelle1!A83","v":"25F"},{"$f":"Tabelle1!B83","v":0}]
[{"$f":"IF(F29=0,\"\",RANK(F29,$F$2:$F$1603,0))","v":""},"Punkte",{"$f":"IF(ISNA(VLOOKUP(C27,Tabelle1!$A$5:$AG$153,32,FALSE)),0,VLOOKUP(C27,Tabelle1!$A$5:$AG$153,32,FALSE))","v":0},{"$f":"IF(ISNA(VLOOKUP(D27,Tabelle1!$A$5:$AG$153,32,FALSE)),0,VLOOKUP(D27,Tabelle1!$A$5:$AG$153,32,FALSE))","v":0},{"$f":"IF(ISNA(VLOOKUP(E27,Tabelle1!$A$5:$AG$153,32,FALSE)),0,VLOOKUP(E27,Tabelle1!$A$5:$AG$153,32,FALSE))","v":0},{"$f":"SUM(C29+D29+E29)","v":0},{"$f":"G27","v":"Team 7"},{"$f":"H27","v":""},{"$f":"I27","v":""},"",0,null,null,null,null,null,{"$f":"Tabelle1!A30","v":"26M"},{"$f":"Tabelle1!B30","v":0},{"$f":"Tabelle1!A84","v":"26F"},{"$f":"Tabelle1!B84","v":0}]
[null,null,null,null,null,null,null,null,null,null,null,null,null,null,null,null,{"$f":"Tabelle1!A31","v":"27M"},{"$f":"Tabelle1!B31","v":0},{"$f":"Tabelle1!A85","v":"27F"},{"$f":"Tabelle1!B85","v":0}]
["Team 8","Starter","19M",null,null,null,{"$f":"A31","v":"Team 8"},{"$f":"C32","v":"Bastian Enzenhofer"},{"$f":"D32","v":""},{"$f":"E32","v":""},{"$f":"F33","v":284},null,null,null,null,null,{"$f":"Tabelle1!A32","v":"28M"},{"$f":"Tabelle1!B32","v":0},{"$f":"Tabelle1!A86","v":"28F"},{"$f":"Tabelle1!B86","v":0}]
["Rang","Namen",{"$f":"IF(ISNA(VLOOKUP(C31,Tabelle1!$A$5:$AG$153,2,FALSE)),\"\",VLOOKUP(C31,Tabelle1!$A$5:$AG$153,2,FALSE))","v":"Bastian Enzenhofer"},{"$f":"IF(ISNA(VLOOKUP(D31,Tabelle1!$A$5:$AG$153,2,FALSE)),\"\",VLOOKUP(D31,Tabelle1!$A$5:$AG$153,2,FALSE))","v":""},{"$f":"IF(ISNA(VLOOKUP(E31,Tabelle1!$A$5:$AG$153,2,FALSE)),\"\",VLOOKUP(E31,Tabelle1!$A$5:$AG$153,2,FALSE))","v":""},"Gesamtpunkte",null,null,null,null,null,null,null,null,null,null,{"$f":"Tabelle1!A33","v":"29M"},{"$f":"Tabelle1!B33","v":0},{"$f":"Tabelle1!A87","v":"29F"},{"$f":"Tabelle1!B87","v":0}]
[{"$f":"IF(F33=0,\"\",RANK(F33,$F$2:$F$1603,0))","v":7},"Punkte",{"$f":"IF(ISNA(VLOOKUP(C31,Tabelle1!$A$5:$AG$153,32,FALSE)),0,VLOOKUP(C31,Tabelle1!$A$5:$AG$153,32,FALSE))","v":284},{"$f":"IF(ISNA(VLOOKUP(D31,Tabelle1!$A$5:$AG$153,32,FALSE)),0,VLOOKUP(D31,Tabelle1!$A$5:$AG$153,32,FALSE))","v":0},{"$f":"IF(ISNA(VLOOKUP(E31,Tabelle1!$A$5:$AG$153,32,FALSE)),0,VLOOKUP(E31,Tabelle1!$A$5:$AG$153,32,FALSE))","v":0},{"$f":"SUM(C33+D33+E33)","v":284},{"$f":"G31","v":"Team 8"},{"$f":"H31","v":"Bastian Enzenhofer"},{"$f":"I31","v":""},"",284,null,null,null,null,null,{"$f":"Tabelle1!A34","v":"30M"},{"$f":"Tabelle1!B34","v":0},{"$f":"Tabelle1!A88","v":"30F"},{"$f":"Tabelle1!B88","v":0}]
[null,null,null,null,null,null,null,null,null,null,null,null,null,null,null,null,{"$f":"Tabelle1!A35","v":"31M"},{"$f":"Tabelle1!B35","v":0},{"$f":"Tabelle1!A89","v":"31F"},{"$f":"Tabelle1!B89","v":0}]
["Team 9","Starter",null,null,null,null,{"$f":"A35","v":"Team 9"},{"$f":"C36","v":""},{"$f":"D36","v":""},{"$f":"E36","v":""},{"$f":"F37","v":0},null,null,null,null,null,{"$f":"Tabelle1!A36","v":"32M"},{"$f":"Tabelle1!B36","v":0},{"$f":"Tabelle1!A90","v":"32F"},{"$f":"Tabelle1!B90","v":0}]
["Rang","Namen",{"$f":"IF(ISNA(VLOOKUP(C35,Tabelle1!$A$5:$AG$153,2,FALSE)),\"\",VLOOKUP(C35,Tabelle1!$A$5:$AG$153,2,FALSE))","v":""},{"$f":"IF(ISNA(VLOOKUP(D35,Tabelle1!$A$5:$AG$153,2,FALSE)),\"\",VLOOKUP(D35,Tabelle1!$A$5:$AG$153,2,FALSE))","v":""},{"$f":"IF(ISNA(VLOOKUP(E35,Tabelle1!$A$5:$AG$153,2,FALSE)),\"\",VLOOKUP(E35,Tabelle1!$A$5:$AG$153,2,FALSE))","v":""},"Gesamtpunkte",null,null,null,null,null,null,null,null,null,null,{"$f":"Tabelle1!A37","v":"33M"},{"$f":"Tabelle1!B37","v":0},{"$f":"Tabelle1!A91","v":"33F"},{"$f":"Tabelle1!B91","v":0}]
[{"$f":"IF(F37=0,\"\",RANK(F37,$F$2:$F$1603,0))","v":""},"Punkte",{"$f":"IF(ISNA(VLOOKUP(C35,Tabelle1!$A$5:$AG$153,32,FALSE)),0,VLOOKUP(C35,Tabelle1!$A$5:$AG$153,32,FALSE))","v":0},{"$f":"IF(ISNA(VLOOKUP(D35,Tabelle1!$A$5:$AG$153,32,FALSE)),0,VLOOKUP(D35,Tabelle1!$A$5:$AG$153,32,FALSE))","v":0},{"$f":"IF(ISNA(VLOOKUP(E35,Tabelle1!$A$5:$AG$153,32,FALSE)),0,VLOOKUP(E35,Tabelle1!$A$5:$AG$153,32,FALSE))","v":0},{"$f":"SUM(C37+D37+E37)","v":0},{"$f":"G35","v":"Team 9"},{"$f":"H35","v":""},{"$f":"I35","v":""},"",0,null,null,null,null,null,{"$f":"Tabelle1!A38","v":"34M"},{"$f":"Tabelle1!B38","v":0},{"$f":"Tabelle1!A92","v":"34F"},{"$f":"Tabelle1!B92","v":0}]
[null,null,null,null,null,null,null,null,null,null,null,null,null,null,null,null,{"$f":"Tabelle1!A39","v":"35M"},{"$f":"Tabelle1!B39","v":0},{"$f":"Tabelle1!A93","v":"35F"},{"$f":"Tabelle1!B93","v":0}]
["Team 10","Starter",null,null,null,null,{"$f":"A39","v":"Team 10"},{"$f":"C40","v":""},{"$f":"D40","v":""},{"$f":"E40","v":""},{"$f":"F41","v":0},null,null,null,null,null,{"$f":"Tabelle1!A40","v":"36M"},{"$f":"Tabelle1!B40","v":0},{"$f":"Tabelle1!A94","v":"36F"},{"$f":"Tabelle1!B94","v":0}]
["Rang","Namen",{"$f":"IF(ISNA(VLOOKUP(C39,Tabelle1!$A$5:$AG$153,2,FALSE)),\"\",VLOOKUP(C39,Tabelle1!$A$5:$AG$153,2,FALSE))","v":""},{"$f":"IF(ISNA(VLOOKUP(D39,Tabelle1!$A$5:$AG$153,2,FALSE)),\"\",VLOOKUP(D39,Tabelle1!$A$5:$AG$153,2,FALSE))","v":""},{"$f":"IF(ISNA(VLOOKUP(E39,Tabelle1!$A$5:$AG$153,2,FALSE)),\"\",VLOOKUP(E39,Tabelle1!$A$5:$AG$153,2,FALSE))","v":""},"Gesamtpunkte",null,null,null,null,null,null,null,null,null,null,{"$f":"Tabelle1!A41","v":"37M"},{"$f":"Tabelle1!B41","v":0},{"$f":"Tabelle1!A95","v":"37F"},{"$f":"Tabelle1!B95","v":0}]
[{"$f":"IF(F41=0,\"\",RANK(F41,$F$2:$F$1603,0))","v":""},"Punkte",{"$f":"IF(ISNA(VLOOKUP(C39,Tabelle1!$A$5:$AG$153,32,FALSE)),0,VLOOKUP(C39,Tabelle1!$A$5:$AG$153,32,FALSE))","v":0},{"$f":"IF(ISNA(VLOOKUP(D39,Tabelle1!$A$5:$AG$153,32,FALSE)),0,VLOOKUP(D39,Tabelle1!$A$5:$AG$153,32,FALSE))","v":0},{"$f":"IF(ISNA(VLOOKUP(E39,Tabelle1!$A$5:$AG$153,32,FALSE)),0,VLOOKUP(E39,Tabelle1!$A$5:$AG$153,32,FALSE))","v":0},{"$f":"SUM(C41+D41+E41)","v":0},{"$f":"G39","v":"Team 10"},{"$f":"H39","v":""},{"$f":"I39","v":""},"",0,null,null,null,null,null,{"$f":"Tabelle1!A42","v":"38M"},{"$f":"Tabelle1!B42","v":0},{"$f":"Tabelle1!A96","v":"38F"},{"$f":"Tabelle1!B96","v":0}]
[null,null,null,null,null,null,null,null,null,null,null,null,null,null,null,null,{"$f":"Tabelle1!A43","v":"39M"},{"$f":"Tabelle1!B43","v":0},{"$f":"Tabelle1!A97","v":"39F"},{"$f":"Tabelle1!B97","v":0}]
["Team 11","Starter",null,null,null,null,{"$f":"A43","v":"Team 11"},{"$f":"C44","v":""},{"$f":"D44","v":""},{"$f":"E44","v":""},{"$f":"F45","v":0},null,null,null,null,null,{"$f":"Tabelle1!A44","v":"40M"},{"$f":"Tabelle1!B44","v":0},{"$f":"Tabelle1!A98","v":"40F"},{"$f":"Tabelle1!B98","v":0}]
["Rang","Namen",{"$f":"IF(ISNA(VLOOKUP(C43,Tabelle1!$A$5:$AG$153,2,FALSE)),\"\",VLOOKUP(C43,Tabelle1!$A$5:$AG$153,2,FALSE))","v":""},{"$f":"IF(ISNA(VLOOKUP(D43,Tabelle1!$A$5:$AG$153,2,FALSE)),\"\",VLOOKUP(D43,Tabelle1!$A$5:$AG$153,2,FALSE))","v":""},{"$f":"IF(ISNA(VLOOKUP(E43,Tabelle1!$A$5:$AG$153,2,FALSE)),\"\",VLOOKUP(E43,Tabelle1!$A$5:$AG$153,2,FALSE))","v":""},"Gesamtpunkte",null,null,null,null,null,null,null,null,null,null,{"$f":"Tabelle1!A45","v":"41M"},{"$f":"Tabelle1!B45","v":0},{"$f":"Tabelle1!A99","v":"41F"},{"$f":"Tabelle1!B99","v":0}]
[{"$f":"IF(F45=0,\"\",RANK(F45,$F$2:$F$1603,0))","v":""},"Punkte",{"$f":"IF(ISNA(VLOOKUP(C43,Tabelle1!$A$5:$AG$153,32,FALSE)),0,VLOOKUP(C43,Tabelle1!$A$5:$AG$153,32,FALSE))","v":0},{"$f":"IF(ISNA(VLOOKUP(D43,Tabelle1!$A$5:$AG$153,32,FALSE)),0,VLOOKUP(D43,Tabelle1!$A$5:$AG$153,32,FALSE))","v":0},{"$f":"IF(ISNA(VLOOKUP(E43,Tabelle1!$A$5:$AG$153,32,FALSE)),0,VLOOKUP(E43,Tabelle1!$A$5:$AG$153,32,FALSE))","v":0},{"$f":"SUM(C45+D45+E45)","v":0},{"$f":"G43","v":"Team 11"},{"$f":"H43","v":""},{"$f":"I43","v":""},"",0,null,null,null,null,null,{"$f":"Tabelle1!A46","v":"42M"},{"$f":"Tabelle1!B46","v":0},{"$f":"Tabelle1!A100","v":"42F"},{"$f":"Tabelle1!B100","v":0}]
[null,null,null,null,null,null,null,null,null,null,null,null,null,null,null,null,{"$f":"Tabelle1!A47","v":"43M"},{"$f":"Tabelle1!B47","v":0},{"$f":"Tabelle1!A101","v":"43F"},{"$f":"Tabelle1!B101","v":0}]
["Team 12","Starter",null,null,null,null,{"$f":"A47","v":"Team 12"},{"$f":"C48","v":""},{"$f":"D48","v":""},{"$f":"E48","v":""},{"$f":"F49","v":0},null,null,null,null,null,{"$f":"Tabelle1!A48","v":"44M"},{"$f":"Tabelle1!B48","v":0},{"$f":"Tabelle1!A102","v":"44F"},{"$f":"Tabelle1!B102","v":0}]
["Rang","Namen",{"$f":"IF(ISNA(VLOOKUP(C47,Tabelle1!$A$5:$AG$153,2,FALSE)),\"\",VLOOKUP(C47,Tabelle1!$A$5:$AG$153,2,FALSE))","v":""},{"$f":"IF(ISNA(VLOOKUP(D47,Tabelle1!$A$5:$AG$153,2,FALSE)),\"\",VLOOKUP(D47,Tabelle1!$A$5:$AG$153,2,FALSE))","v":""},{"$f":"IF(ISNA(VLOOKUP(E47,Tabelle1!$A$5:$AG$153,2,FALSE)),\"\",VLOOKUP(E47,Tabelle1!$A$5:$AG$153,2,FALSE))","v":""},"Gesamtpunkte",null,null,null,null,null,null,null,null,null,null,{"$f":"Tabelle1!A49","v":"45M"},{"$f":"Tabelle1!B49","v":0},{"$f":"Tabelle1!A103","v":"45F"},{"$f":"Tabelle1!B103","v":0}]
[{"$f":"IF(F49=0,\"\",RANK(F49,$F$2:$F$1603,0))","v":""},"Punkte",{"$f":"IF(ISNA(VLOOKUP(C47,Tabelle1!$A$5:$AG$153,32,FALSE)),0,VLOOKUP(C47,Tabelle1!$A$5:$AG$153,32,FALSE))","v":0},{"$f":"IF(ISNA(VLOOKUP(D47,Tabelle1!$A$5:$AG$153,32,FALSE)),0,VLOOKUP(D47,Tabelle1!$A$5:$AG$153,32,FALSE))","v":0},{"$f":"IF(ISNA(VLOOKUP(E47,Tabelle1!$A$5:$AG$153,32,FALSE)),0,VLOOKUP(E47,Tabelle1!$A$5:$AG$153,32,FALSE))","v":0},{"$f":"SUM(C49+D49+E49)","v":0},{"$f":"G47","v":"Team 12"},{"$f":"H47","v":""},{"$f":"I47","v":""},"",0,null,null,null,null,null,{"$f":"Tabelle1!A50","v":"46M"},{"$f":"Tabelle1!B50","v":0},{"$f":"Tabelle1!A104","v":"46F"},{"$f":"Tabelle1!B104","v":0}]
[null,null,null,null,null,null,null,null,null,null,null,null,null,null,null,null,{"$f":"Tabelle1!A51","v":"47M"},{"$f":"Tabelle1!B51","v":0},{"$f":"Tabelle1!A105","v":"47F"},{"$f":"Tabelle1!B105","v":0}]
["Team 13","Starter",null,null,null,null,{"$f":"A51","v":"Team 13"},{"$f":"C52","v":""},{"$f":"D52","v":""},{"$f":"E52","v":""},{"$f":"F53","v":0},null,null,null,null,null,{"$f":"Tabelle1!A52","v":"48M"},{"$f":"Tabelle1!B52","v":0},{"$f":"Tabelle1!A106","v":"48F"},{"$f":"Tabelle1!B106","v":0}]
["Rang","Namen",{"$f":"IF(ISNA(VLOOKUP(C51,Tabelle1!$A$5:$AG$153,2,FALSE)),\"\",VLOOKUP(C51,Tabelle1!$A$5:$AG$153,2,FALSE))","v":""},{"$f":"IF(ISNA(VLOOKUP(D51,Tabelle1!$A$5:$AG$153,2,FALSE)),\"\",VLOOKUP(D51,Tabelle1!$A$5:$AG$153,2,FALSE))","v":""},{"$f":"IF(ISNA(VLOOKUP(E51,Tabelle1!$A$5:$AG$153,2,FALSE)),\"\",VLOOKUP(E51,Tabelle1!$A$5:$AG$153,2,FALSE))","v":""},"Gesamtpunkte",null,null,null,null,null,null,null,null,null,null,{"$f":"Tabelle1!A53","v":"49M"},{"$f":"Tabelle1!B53","v":0},{"$f":"Tabelle1!A107","v":"49F"},{"$f":"Tabelle1!B107","v":0}]
[{"$f":"IF(F53=0,\"\",RANK(F53,$F$2:$F$1603,0))","v":""},"Punkte",{"$f":"IF(ISNA(VLOOKUP(C51,Tabelle1!$A$5:$AG$153,32,FALSE)),0,VLOOKUP(C51,Tabelle1!$A$5:$AG$153,32,FALSE))","v":0},{"$f":"IF(ISNA(VLOOKUP(D51,Tabelle1!$A$5:$AG$153,32,FALSE)),0,VLOOKUP(D51,Tabelle1!$A$5:$AG$153,32,FALSE))","v":0},{"$f":"IF(ISNA(VLOOKUP(E51,Tabelle1!$A$5:$AG$153,32,FALSE)),0,VLOOKUP(E51,Tabelle1!$A$5:$AG$153,32,FALSE))","v":0},{"$f":"SUM(C53+D53+E53)","v":0},{"$f":"G51","v":"Team 13"},{"$f":"H51","v":""},{"$f":"I51","v":""},"",0,null,null,null,null,null,{"$f":"Tabelle1!A54","v":"50M"},{"$f":"Tabelle1!B54","v":0},{"$f":"Tabelle1!A108","v":"50F"},{"$f":"Tabelle1!B108","v":0}]
[]
["Team 14","Starter",null,null,null,null,{"$f":"A55","v":"Team 14"},{"$f":"C56","v":""},{"$f":"D56","v":""},{"$f":"E56","v":""},{"$f":"F57","v":0}]
["Rang","Namen",{"$f":"IF(ISNA(VLOOKUP(C55,Tabelle1!$A$5:$AG$153,2,FALSE)),\"\",VLOOKUP(C55,Tabelle1!$A$5:$AG$153,2,FALSE))","v":""},{"$f":"IF(ISNA(VLOOKUP(D55,Tabelle1!$A$5:$AG$153,2,FALSE)),\"\",VLOOKUP(D55,Tabelle1!$A$5:$AG$153,2,FALSE))","v":""},{"$f":"IF(ISNA(VLOOKUP(E55,Tabelle1!$A$5:$AG$153,2,FALSE)),\"\",VLOOKUP(E55,Tabelle1!$A$5:$AG$153,2,FALSE))","v":""},"Gesamtpunkte"]
[{"$f":"IF(F57=0,\"\",RANK(F57,$F$2:$F$1603,0))","v":""},"Punkte",{"$f":"IF(ISNA(VLOOKUP(C55,Tabelle1!$A$5:$AG$153,32,FALSE)),0,VLOOKUP(C55,Tabelle1!$A$5:$AG$153,32,FALSE))","v":0},{"$f":"IF(ISNA(VLOOKUP(D55,Tabelle1!$A$5:$AG$153,32,FALSE)),0,VLOOKUP(D55,Tabelle1!$A$5:$AG$153,32,FALSE))","v":0},{"$f":"IF(ISNA(VLOOKUP(E55,Tabelle1!$A$5:$AG$153,32,FALSE)),0,VLOOKUP(E55,Tabelle1!$A$5:$AG$153,32,FALSE))","v":0},{"$f":"SUM(C57+D57+E57)","v":0},{"$f":"G55","v":"Team 14"},{"$f":"H55","v":""},{"$f":"I55","v":""},"",0]
[]
["Team 15","Starter",null,null,null,null,{"$f":"G57","v":"Team 14"},{"$f":"H57","v":""},{"$f":"I57","v":""},"",0]
["Rang","Namen",{"$f":"IF(ISNA(VLOOKUP(C59,Tabelle1!$A$5:$AG$153,2,FALSE)),\"\",VLOOKUP(C59,Tabelle1!$A$5:$AG$153,2,FALSE))","v":""},{"$f":"IF(ISNA(VLOOKUP(D59,Tabelle1!$A$5:$AG$153,2,FALSE)),\"\",VLOOKUP(D59,Tabelle1!$A$5:$AG$153,2,FALSE))","v":""},{"$f":"IF(ISNA(VLOOKUP(E59,Tabelle1!$A$5:$AG$153,2,FALSE)),\"\",VLOOKUP(E59,Tabelle1!$A$5:$AG$153,2,FALSE))","v":""},"Gesamtpunkte"]
[{"$f":"IF(F61=0,\"\",RANK(F61,$F$2:$F$1603,0))","v":""},"Punkte",{"$f":"IF(ISNA(VLOOKUP(C59,Tabelle1!$A$5:$AG$153,32,FALSE)),0,VLOOKUP(C59,Tabelle1!$A$5:$AG$153,32,FALSE))","v":0},{"$f":"IF(ISNA(VLOOKUP(D59,Tabelle1!$A$5:$AG$153,32,FALSE)),0,VLOOKUP(D59,Tabelle1!$A$5:$AG$153,32,FALSE))","v":0},{"$f":"IF(ISNA(VLOOKUP(E59,Tabelle1!$A$5:$AG$153,32,FALSE)),0,VLOOKUP(E59,Tabelle1!$A$5:$AG$153,32,FALSE))","v":0},{"$f":"SUM(C61+D61+E61)","v":0},{"$f":"A59","v":"Team 15"},{"$f":"C60","v":""},{"$f":"D60","v":""},{"$f":"E60","v":""},{"$f":"F61","v":0}]

{"sheet":"Eckdaten","index":2,"n_rows":53,"n_cols":29,"rows_kept":53,"cut":false,"hidden":true,"merged":[]}
["Teilnehmer"]
[50]
[]
["Teilnehmer kommen weiter",null,null,null,null,null,null,null,null,null,null,null,null,null,null,null,null,null,null,null,null,null,null,null,null,null,null,null,{"$f":"B4","v":0}]
["von","bis",null,null,null,null,null,null,null,null,null,null,null,null,null,null,null,null,null,null,null,null,null,null,null,null,null,null,{"$f":"B5","v":"bis"}]
[11,{"$f":"A2","v":50},null,null,null,null,null,null,null,null,null,null,null,null,null,null,null,null,null,null,null,null,null,null,null,null,null,null,50]
[null,null,null,null,null,null,null,null,null,null,null,null,null,null,null,null,null,null,null,null,null,null,null,null,null,null,null,null,0]
["Zeitstrafe heißer Draht",null,null,null,null,null,null,null,null,null,null,null,null,null,null,null,null,null,null,null,null,null,null,null,null,null,null,null,0]
[3,"sec je Berührung",null,null,null,null,null,null,null,null,null,null,null,null,null,null,null,null,null,null,null,null,null,null,null,null,null,null,"sec je Berührung"]
[null,null,null,null,null,null,null,null,null,null,null,null,null,null,null,null,null,null,null,null,null,null,null,null,null,null,null,null,0]
[null,null,null,null,null,null,null,null,null,null,null,null,null,null,null,null,null,null,null,null,null,null,null,null,null,null,null,null,0]
[null,null,null,null,null,null,null,null,null,null,null,null,null,null,null,null,null,null,null,null,null,null,null,null,null,null,null,null,0]
[null,null,null,null,null,null,null,null,null,null,null,null,null,null,null,null,null,null,null,null,null,null,null,null,null,null,null,null,0]
[null,null,null,null,null,null,null,null,null,null,null,null,null,null,null,null,null,null,null,null,null,null,null,null,null,null,null,null,0]
[null,null,null,null,null,null,null,null,null,null,null,null,null,null,null,null,null,null,null,null,null,null,null,null,null,null,null,null,0]
[null,null,null,null,null,null,null,null,null,null,null,null,null,null,null,null,null,null,null,null,null,null,null,null,null,null,null,null,0]
[null,null,null,null,null,null,null,null,null,null,null,null,null,null,null,null,null,null,null,null,null,null,null,null,null,null,null,null,0]
[null,null,null,null,null,null,null,null,null,null,null,null,null,null,null,null,null,null,null,null,null,null,null,null,null,null,null,null,0]
[null,null,null,null,null,null,null,null,null,null,null,null,null,null,null,null,null,null,null,null,null,null,null,null,null,null,null,null,0]
[null,null,null,null,null,null,null,null,null,null,null,null,null,null,null,null,null,null,null,null,null,null,null,null,null,null,null,null,0]
[null,null,null,null,null,null,null,null,null,null,null,null,null,null,null,null,null,null,null,null,null,null,null,null,null,null,null,null,0]
[null,null,null,null,null,null,null,null,null,null,null,null,null,null,null,null,null,null,null,null,null,null,null,null,null,null,null,null,0]
[null,null,null,null,null,null,null,null,null,null,null,null,null,null,null,null,null,null,null,null,null,null,null,null,null,null,null,null,0]
[null,null,null,null,null,null,null,null,null,null,null,null,null,null,null,null,null,null,null,null,null,null,null,null,null,null,null,null,0]
[null,null,null,null,null,null,null,null,null,null,null,null,null,null,null,null,null,null,null,null,null,null,null,null,null,null,null,null,0]
[null,null,null,null,null,null,null,null,null,null,null,null,null,null,null,null,null,null,null,null,null,null,null,null,null,null,null,null,0]
[null,null,null,null,null,null,null,null,null,null,null,null,null,null,null,null,null,null,null,null,null,null,null,null,null,null,null,null,0]
[null,null,null,null,null,null,null,null,null,null,null,null,null,null,null,null,null,null,null,null,null,null,null,null,null,null,null,null,0]
[null,null,null,null,null,null,null,null,null,null,null,null,null,null,null,null,null,null,null,null,null,null,null,null,null,null,null,null,0]
[null,null,null,null,null,null,null,null,null,null,null,null,null,null,null,null,null,null,null,null,null,null,null,null,null,null,null,null,0]
[null,null,null,null,null,null,null,null,null,null,null,null,null,null,null,null,null,null,null,null,null,null,null,null,null,null,null,null,0]
[null,null,null,null,null,null,null,null,null,null,null,null,null,null,null,null,null,null,null,null,null,null,null,null,null,null,null,null,0]
[null,null,null,null,null,null,null,null,null,null,null,null,null,null,null,null,null,null,null,null,null,null,null,null,null,null,null,null,0]
[null,null,null,null,null,null,null,null,null,null,null,null,null,null,null,null,null,null,null,null,null,null,null,null,null,null,null,null,0]
[null,null,null,null,null,null,null,null,null,null,null,null,null,null,null,null,null,null,null,null,null,null,null,null,null,null,null,null,0]
[null,null,null,null,null,null,null,null,null,null,null,null,null,null,null,null,null,null,null,null,null,null,null,null,null,null,null,null,0]
[null,null,null,null,null,null,null,null,null,null,null,null,null,null,null,null,null,null,null,null,null,null,null,null,null,null,null,null,0]
[null,null,null,null,null,null,null,null,null,null,null,null,null,null,null,null,null,null,null,null,null,null,null,null,null,null,null,null,0]
[null,null,null,null,null,null,null,null,null,null,null,null,null,null,null,null,null,null,null,null,null,null,null,null,null,null,null,null,0]
[null,null,null,null,null,null,null,null,null,null,null,null,null,null,null,null,null,null,null,null,null,null,null,null,null,null,null,null,0]
[null,null,null,null,null,null,null,null,null,null,null,null,null,null,null,null,null,null,null,null,null,null,null,null,null,null,null,null,0]
[null,null,null,null,null,null,null,null,null,null,null,null,null,null,null,null,null,null,null,null,null,null,null,null,null,null,null,null,0]
[null,null,null,null,null,null,null,null,null,null,null,null,null,null,null,null,null,null,null,null,null,null,null,null,null,null,null,null,0]
[null,null,null,null,null,null,null,null,null,null,null,null,null,null,null,null,null,null,null,null,null,null,null,null,null,null,null,null,0]
[null,null,null,null,null,null,null,null,null,null,null,null,null,null,null,null,null,null,null,null,null,null,null,null,null,null,null,null,0]
[null,null,null,null,null,null,null,null,null,null,null,null,null,null,null,null,null,null,null,null,null,null,null,null,null,null,null,null,0]
[null,null,null,null,null,null,null,null,null,null,null,null,null,null,null,null,null,null,null,null,null,null,null,null,null,null,null,null,0]
[null,null,null,null,null,null,null,null,null,null,null,null,null,null,null,null,null,null,null,null,null,null,null,null,null,null,null,null,0]
[null,null,null,null,null,null,null,null,null,null,null,null,null,null,null,null,null,null,null,null,null,null,null,null,null,null,null,null,0]
[null,null,null,null,null,null,null,null,null,null,null,null,null,null,null,null,null,null,null,null,null,null,null,null,null,null,null,null,0]
[null,null,null,null,null,null,null,null,null,null,null,null,null,null,null,null,null,null,null,null,null,null,null,null,null,null,null,null,0]
[null,null,null,null,null,null,null,null,null,null,null,null,null,null,null,null,null,null,null,null,null,null,null,null,null,null,null,null,0]
[null,null,null,null,null,null,null,null,null,null,null,null,null,null,null,null,null,null,null,null,null,null,null,null,null,null,null,null,0]